program: Orca
programVersion: 5.0.2
elementType: O O O C C C C C C C C C C C C C C C C C C C C C C C H H H H H H H H H H H H H H H H H H H H H H H H H H
charge: 0
multiplicity: 1
keywords: wb97x-d3
keywords: def2-TZVPP
keywords: def2/J RIJCOSX
keywords: DEFGRID2
keywords: scfconv7
keywords: smallprint printgap noloewdin
keywords: NOSOSCF
formula: C23H26O3
InChI: InChI=1/C23H26O3/c1-16(2)13-20-21(23(20,3)4)22(24)25-15-17-9-8-12-19(14-17)26-18-10-6-5-7-11-18/h5-14,20-21H,15H2,1-4H3
52 atoms
O  -2.024453 1.231279 -0.671967
O  -1.786362 1.775316 1.47434
O  3.009991 0.94003 -0.33151
C  -3.386128 -1.335418 0.238323
C  -1.932041 -1.69365 0.214427
C  -2.401891 -0.440666 0.96679
C  -4.273144 -2.155057 1.146895
C  -4.102935 -0.900348 -1.016827
C  -1.105467 -1.649241 -1.005768
C  -2.046342 0.950246 0.628617
C  -0.173233 -2.543894 -1.3563
C  0.591541 -2.376566 -2.634993
C  0.184732 -3.774011 -0.578987
C  -1.588415 2.527218 -1.071039
C  -0.127603 2.765026 -0.799904
C  0.771002 1.70916 -0.728018
C  0.332235 4.068861 -0.640988
C  2.104082 1.960742 -0.434446
C  1.676392 4.309152 -0.402436
C  2.571124 3.255838 -0.278468
C  2.748203 -0.137719 0.466053
C  3.470216 -1.292772 0.187182
C  1.856384 -0.106716 1.533004
C  3.299838 -2.417027 0.979827
C  1.688188 -1.246261 2.308393
C  2.404821 -2.403577 2.041483
H  -1.660813 -2.482042 0.907728
H  -2.405347 -0.563613 2.043739
H  -4.612387 -3.05929 0.637102
H  -5.15894 -1.589342 1.444078
H  -3.755636 -2.462479 2.05674
H  -4.910355 -0.204964 -0.779161
H  -4.556353 -1.774773 -1.488114
H  -3.468667 -0.430259 -1.76216
H  -1.281345 -0.832779 -1.694731
H  0.497996 -3.260486 -3.27203
H  1.659719 -2.252705 -2.434544
H  0.256748 -1.511761 -3.20824
H  -0.224521 -4.662861 -1.068292
H  -0.176597 -3.771497 0.44749
H  1.267097 -3.912088 -0.548536
H  -2.196084 3.302551 -0.599134
H  -1.788535 2.563377 -2.142572
H  0.44134 0.686548 -0.872958
H  -0.363666 4.897475 -0.693907
H  2.029056 5.325164 -0.281661
H  3.615741 3.435799 -0.05822
H  4.164266 -1.305247 -0.644249
H  1.291798 0.785259 1.77177
H  3.866767 -3.312043 0.75759
H  0.991072 -1.217413 3.136176
H  2.26822 -3.285261 2.653558
elementType: O C H
totalener: -1117.86411822 hartree
nucrepener: 2408.85701110 hartree
electener: -3526.72112932 hartree
oneelecener: -6307.47034502 hartree
twoeener: 2780.74921569 hartree
cpcmener: -0.02642890 hartree
kineticenergy: 1112.80320264 hartree
xcener: -110.233793465789 hartree
chargesum: 0.0000000
charge: -0.280204 -0.462386 -0.327113 0.115061 0.036512 -0.107014 -0.269982 -0.272705 -0.288660 0.386726 -0.055581 -0.219562 -0.300609 0.063015 0.025694 -0.190302 -0.215165 0.249221 -0.122620 -0.230863 0.340873 -0.274519 -0.205251 -0.125224 -0.157949 -0.189029 0.116955 0.095822 0.094906 0.094790 0.086826 0.103120 0.094690 0.092986 0.128172 0.102693 0.089536 0.088811 0.119031 0.092750 0.095184 0.121181 0.118093 0.134296 0.140631 0.157171 0.144704 0.142850 0.149695 0.158548 0.158700 0.155498
qa: -0.2802 -0.4624 -0.3271 0.1151 0.0365 -0.1070 -0.2700 -0.2727 -0.2887 0.3867 -0.0556 -0.2196 -0.3006 0.0630 0.0257 -0.1903 -0.2152 0.2492 -0.1226 -0.2309 0.3409 -0.2745 -0.2053 -0.1252 -0.1579 -0.1890 0.1170 0.0958 0.0949 0.0948 0.0868 0.1031 0.0947 0.0930 0.1282 0.1027 0.0895 0.0888 0.1190 0.0927 0.0952 0.1212 0.1181 0.1343 0.1406 0.1572 0.1447 0.1429 0.1497 0.1585 0.1587 0.1555
va: 2.1041 2.0346 2.0889 3.7543 3.6975 3.8340 3.9107 3.9020 3.8082 4.1405 3.6888 3.9113 3.9436 3.8044 3.6194 3.8982 3.9650 3.7531 3.8908 4.0032 3.6301 3.9419 3.8426 3.8175 3.8555 3.8480 0.9976 1.0267 1.0016 1.0016 1.0061 1.0007 1.0011 1.0092 1.0090 0.9971 0.9978 1.0087 0.9968 1.0093 0.9956 1.0073 0.9946 1.0131 1.0009 0.9890 1.0062 1.0104 1.0087 0.9884 0.9906 0.9916
dispcorr: -0.031002293 hartree
energy: -1117.895120514794
dipole: -13.59601 12.86347 -0.73253 -20.02764 19.13136 -0.89628 -5.26018 4.43539 -0.82479
magnitude: 1.42134 au
magnitude: 3.61275 debye
