program: Orca
programVersion: 5.0.2
elementType: O O O C C C C C C C C C C C C C C C C C C C C C C C H H H H H H H H H H H H H H H H H H H H H H H H H H
charge: 0
multiplicity: 1
keywords: wb97x-d3
keywords: def2-TZVPP
keywords: def2/J RIJCOSX
keywords: DEFGRID2
keywords: scfconv7
keywords: smallprint printgap noloewdin
keywords: NOSOSCF
formula: C23H26O3
InChI: InChI=1/C23H26O3/c1-16(2)13-20-21(23(20,3)4)22(24)25-15-17-9-8-12-19(14-17)26-18-10-6-5-7-11-18/h5-14,20-21H,15H2,1-4H3
52 atoms
O  -1.932364 2.163014 -0.352094
O  -3.020073 0.588821 -1.505463
O  2.862289 0.452807 0.710088
C  -4.886434 0.297307 0.948456
C  -3.663414 -0.46587 1.325283
C  -3.542702 0.976046 0.802361
C  -5.732223 0.835517 2.080005
C  -5.709899 -0.10717 -0.249741
C  -3.162507 -1.623209 0.546302
C  -2.848582 1.195894 -0.47596
C  -1.898253 -2.051399 0.595642
C  -1.442021 -3.252853 -0.170732
C  -0.855549 -1.347168 1.417554
C  -1.018749 2.362039 -1.43963
C  0.054544 1.311008 -1.416493
C  1.030306 1.364468 -0.426298
C  0.063639 0.2628 -2.329128
C  1.990209 0.368137 -0.337529
C  1.032015 -0.72712 -2.235332
C  1.994155 -0.691105 -1.237845
C  4.166569 0.065496 0.583127
C  4.757645 -0.501841 1.704501
C  4.9062 0.277538 -0.574425
C  6.097019 -0.859302 1.665842
C  6.242018 -0.097445 -0.601961
C  6.844262 -0.665957 0.511905
H  -3.454702 -0.521034 2.391216
H  -3.308784 1.715971 1.559007
H  -6.286331 1.723094 1.767594
H  -5.128881 1.108916 2.946965
H  -6.458675 0.088105 2.405823
H  -5.134196 -0.552211 -1.0554
H  -6.239779 0.754692 -0.659928
H  -6.46275 -0.835743 0.058429
H  -3.874866 -2.161797 -0.071011
H  -0.659196 -2.98293 -0.885069
H  -2.254865 -3.725106 -0.722732
H  -1.005375 -4.001844 0.495768
H  -1.061737 -1.434291 2.487858
H  -0.811923 -0.279351 1.194233
H  0.138913 -1.759764 1.248013
H  -0.597824 3.351869 -1.267555
H  -1.542335 2.38128 -2.396205
H  1.040731 2.178634 0.289939
H  -0.685337 0.214145 -3.108501
H  1.032546 -1.547582 -2.941253
H  2.729572 -1.482396 -1.166498
H  4.170546 -0.654097 2.601844
H  4.455423 0.73079 -1.448309
H  6.554669 -1.297533 2.543552
H  6.816012 0.063417 -1.505569
H  7.887124 -0.952757 0.481587
elementType: O C H
totalener: -1117.86434677 hartree
nucrepener: 2291.92355970 hartree
electener: -3409.78790647 hartree
oneelecener: -6073.95395946 hartree
twoeener: 2664.16605299 hartree
cpcmener: -0.02464045 hartree
kineticenergy: 1112.81146733 hartree
xcener: -110.229012687191 hartree
chargesum: 0.0000000
charge: -0.290327 -0.461024 -0.329908 0.134566 -0.032983 -0.091419 -0.264206 -0.297779 -0.257233 0.375545 -0.004181 -0.216845 -0.309711 0.081888 0.059362 -0.343689 -0.186261 0.338206 -0.156814 -0.204094 0.307495 -0.260033 -0.209620 -0.117985 -0.144166 -0.188322 0.111500 0.090530 0.096097 0.085745 0.093863 0.094183 0.099664 0.097423 0.121438 0.091100 0.087114 0.101579 0.118013 0.093372 0.099717 0.123514 0.112367 0.126867 0.137722 0.159857 0.155962 0.144341 0.154675 0.156661 0.158704 0.157531
qa: -0.2903 -0.4610 -0.3299 0.1346 -0.0330 -0.0914 -0.2642 -0.2978 -0.2572 0.3755 -0.0042 -0.2168 -0.3097 0.0819 0.0594 -0.3437 -0.1863 0.3382 -0.1568 -0.2041 0.3075 -0.2600 -0.2096 -0.1180 -0.1442 -0.1883 0.1115 0.0905 0.0961 0.0857 0.0939 0.0942 0.0997 0.0974 0.1214 0.0911 0.0871 0.1016 0.1180 0.0934 0.0997 0.1235 0.1124 0.1269 0.1377 0.1599 0.1560 0.1443 0.1547 0.1567 0.1587 0.1575
va: 2.1044 2.0280 2.0580 3.7628 3.8102 3.8314 3.8970 3.8893 3.8075 4.1409 3.6563 3.9126 3.9712 3.8191 3.5520 4.0457 3.9116 3.6101 3.8732 3.8842 3.6783 4.0107 3.9122 3.8853 3.8920 3.9078 1.0039 1.0331 1.0023 1.0048 1.0026 1.0184 1.0004 0.9988 1.0014 0.9945 1.0093 0.9943 1.0011 0.9955 1.0024 0.9945 1.0104 1.0255 1.0169 0.9908 0.9969 1.0097 0.9989 0.9896 0.9904 0.9908
dispcorr: -0.028055642 hartree
energy: -1117.892402411511
dipole: -18.88055 19.53013 0.64958 -9.52560 9.55884 0.03324 5.23972 -4.80908 0.43064
magnitude: 0.78007 au
magnitude: 1.98277 debye
