program: Orca
programVersion: 5.0.2
elementType: O O O C C C C C C C C C C C C C C C C C C C C C C C H H H H H H H H H H H H H H H H H H H H H H H H H H
charge: 0
multiplicity: 1
keywords: wb97x-d3
keywords: def2-TZVPP
keywords: def2/J RIJCOSX
keywords: DEFGRID2
keywords: scfconv7
keywords: smallprint printgap noloewdin
keywords: NOSOSCF
formula: C23H26O3
InChI: InChI=1/C23H26O3/c1-16(2)13-20-21(23(20,3)4)22(24)25-15-17-9-8-12-19(14-17)26-18-10-6-5-7-11-18/h5-14,20-21H,15H2,1-4H3
52 atoms
O  -1.695316 1.877847 -0.732861
O  -1.008018 1.060517 1.228872
O  2.89393 0.412753 -2.222804
C  -1.911217 -1.652314 -0.108505
C  -3.049184 -1.243194 0.772037
C  -2.448697 -0.232569 -0.203861
C  -2.240061 -2.536868 -1.288115
C  -0.540813 -1.92429 0.45985
C  -2.945839 -1.130089 2.238714
C  -1.648812 0.930618 0.214227
C  -3.927595 -1.387755 3.111444
C  -3.68417 -1.269688 4.58671
C  -5.320896 -1.810199 2.756879
C  -0.919624 3.05239 -0.554208
C  0.530678 2.875365 -0.922792
C  1.045528 1.677197 -1.394517
C  1.373477 3.981112 -0.810516
C  2.39164 1.5913 -1.730993
C  2.707079 3.886392 -1.168114
C  3.232224 2.683943 -1.626105
C  2.928383 -0.677746 -1.399916
C  3.066348 -0.574039 -0.020563
C  2.862326 -1.924751 -2.010307
C  3.143919 -1.731992 0.741739
C  2.944883 -3.071421 -1.234877
C  3.084581 -2.982947 0.144123
H  -4.014702 -1.58659 0.418557
H  -3.055783 -0.038238 -1.080268
H  -3.227426 -2.320635 -1.698135
H  -2.226731 -3.588641 -0.994188
H  -1.509848 -2.407825 -2.08995
H  -0.475097 -2.969229 0.769735
H  -0.279372 -1.31431 1.319814
H  0.221772 -1.762058 -0.304453
H  -1.986475 -0.837741 2.64766
H  -3.860051 -2.223611 5.092145
H  -4.370761 -0.550528 5.041942
H  -2.666548 -0.952601 4.81485
H  -5.54387 -2.790646 3.186821
H  -5.513221 -1.870881 1.68772
H  -6.051111 -1.117044 3.182732
H  -1.007136 3.429304 0.467634
H  -1.375799 3.794398 -1.210726
H  0.421231 0.801926 -1.526723
H  0.979436 4.923124 -0.447357
H  3.350974 4.752085 -1.081704
H  4.27669 2.599016 -1.898043
H  3.121881 0.392585 0.464008
H  2.751773 -1.992317 -3.085579
H  3.254426 -1.648242 1.815395
H  2.893309 -4.040232 -1.715171
H  3.146337 -3.879713 0.746342
elementType: O C H
totalener: -1117.86763195 hartree
nucrepener: 2310.16752360 hartree
electener: -3428.03515556 hartree
oneelecener: -6110.35836458 hartree
twoeener: 2682.32320902 hartree
cpcmener: -0.02589905 hartree
kineticenergy: 1112.78792699 hartree
xcener: -110.228462622607 hartree
chargesum: -0.0000000
charge: -0.294536 -0.456445 -0.333223 0.140944 0.020438 -0.076498 -0.264319 -0.281786 -0.286603 0.356293 -0.059388 -0.218579 -0.255858 0.080967 0.014497 -0.165909 -0.214712 0.205474 -0.130799 -0.205031 0.264888 -0.171980 -0.216610 -0.167004 -0.127989 -0.186739 0.118794 0.096310 0.088517 0.095352 0.093402 0.106508 0.102822 0.054391 0.119139 0.091938 0.092119 0.088599 0.096685 0.087685 0.094997 0.117824 0.130653 0.146325 0.142711 0.157479 0.147227 0.149780 0.143029 0.156841 0.155696 0.155686
qa: -0.2945 -0.4564 -0.3332 0.1409 0.0204 -0.0765 -0.2643 -0.2818 -0.2866 0.3563 -0.0594 -0.2186 -0.2559 0.0810 0.0145 -0.1659 -0.2147 0.2055 -0.1308 -0.2050 0.2649 -0.1720 -0.2166 -0.1670 -0.1280 -0.1867 0.1188 0.0963 0.0885 0.0954 0.0934 0.1065 0.1028 0.0544 0.1191 0.0919 0.0921 0.0886 0.0967 0.0877 0.0950 0.1178 0.1307 0.1463 0.1427 0.1575 0.1472 0.1498 0.1430 0.1568 0.1557 0.1557
va: 2.1148 2.0303 2.0635 3.7099 3.7729 3.8271 3.9044 3.8943 3.8522 4.1350 3.7936 3.9223 3.9390 3.8311 3.6571 3.9548 3.9659 3.7982 3.8815 3.9868 3.6928 3.8358 3.9568 3.8699 3.8827 3.8686 0.9999 1.0303 1.0060 1.0014 1.0019 1.0027 1.0137 1.0153 1.0229 0.9960 0.9966 1.0090 0.9965 1.0144 0.9975 1.0122 0.9910 1.0027 0.9996 0.9893 1.0037 1.0025 1.0091 0.9923 0.9896 0.9918
dispcorr: -0.026979939 hartree
energy: -1117.894611891781
dipole: -20.51553 19.65539 -0.86014 -15.70798 15.63679 -0.07120 14.04268 -14.25891 -0.21623
magnitude: 0.88975 au
magnitude: 2.26158 debye
