program: Orca
programVersion: 5.0.2
elementType: O O O C C C C C C C C C C C C C C C C C C C C C C C H H H H H H H H H H H H H H H H H H H H H H H H H H
charge: 0
multiplicity: 1
keywords: wb97x-d3
keywords: def2-TZVPP
keywords: def2/J RIJCOSX
keywords: DEFGRID2
keywords: scfconv7
keywords: smallprint printgap noloewdin
keywords: NOSOSCF
formula: C23H26O3
InChI: InChI=1/C23H26O3/c1-16(2)13-20-21(23(20,3)4)22(24)25-15-17-9-8-12-19(14-17)26-18-10-6-5-7-11-18/h5-14,20-21H,15H2,1-4H3
52 atoms
O  -2.272836 1.470187 -1.759654
O  -2.610985 2.410643 0.235313
O  2.649778 -0.045544 -1.526668
C  -3.109802 -1.138744 -0.425793
C  -3.269904 -0.593908 0.978826
C  -3.568597 0.273127 -0.214958
C  -4.141837 -2.1254 -0.912623
C  -1.717935 -1.427371 -0.926913
C  -2.093588 -0.350352 1.855416
C  -2.757675 1.483237 -0.522986
C  -1.478869 -1.297682 2.56919
C  -0.316411 -0.97293 3.456435
C  -1.881551 -2.73939 2.551305
C  -1.402673 2.543303 -2.149186
C  -0.049869 2.388419 -1.514822
C  0.704234 1.250373 -1.791237
C  0.445741 3.337674 -0.631185
C  1.935297 1.071257 -1.185661
C  1.691667 3.157602 -0.043504
C  2.443695 2.0254 -0.31113
C  3.197619 -0.828528 -0.550552
C  4.36446 -1.507284 -0.878545
C  2.608375 -0.997042 0.697173
C  4.946071 -2.357072 0.049981
C  3.210916 -1.841142 1.619482
C  4.378176 -2.522915 1.305606
H  -4.158264 -0.942744 1.499248
H  -4.623068 0.465946 -0.401538
H  -4.217457 -2.111315 -2.002443
H  -5.132897 -1.909042 -0.510358
H  -3.879023 -3.143035 -0.614945
H  -0.969783 -0.728451 -0.556027
H  -1.681168 -1.410082 -2.018021
H  -1.407176 -2.425678 -0.608909
H  -1.722621 0.666095 1.940402
H  -0.53581 -1.2165 4.499698
H  -0.041554 0.081053 3.409144
H  0.561119 -1.565009 3.183421
H  -1.045308 -3.36926 2.236075
H  -2.721594 -2.943912 1.889436
H  -2.156341 -3.078629 3.554132
H  -1.844764 3.512427 -1.913738
H  -1.337181 2.458282 -3.233481
H  0.336715 0.498377 -2.479995
H  -0.13787 4.220161 -0.40135
H  2.078538 3.903699 0.638447
H  3.412469 1.890873 0.153633
H  4.810244 -1.371048 -1.855885
H  1.689967 -0.485187 0.956629
H  5.854682 -2.884605 -0.210334
H  2.755232 -1.969263 2.592815
H  4.838001 -3.180355 2.031242
elementType: O C H
totalener: -1117.86149179 hartree
nucrepener: 2348.45804562 hartree
electener: -3466.31953741 hartree
oneelecener: -6186.47396193 hartree
twoeener: 2720.15442452 hartree
cpcmener: -0.02570813 hartree
kineticenergy: 1112.81474648 hartree
xcener: -110.227413866379 hartree
chargesum: 0.0000000
charge: -0.271706 -0.452183 -0.330522 0.111093 -0.038523 -0.069097 -0.272672 -0.287469 -0.255072 0.372775 -0.036041 -0.249480 -0.261965 0.072605 0.051607 -0.328795 -0.186643 0.281618 -0.133584 -0.184455 0.292127 -0.247568 -0.186586 -0.124382 -0.162171 -0.188639 0.110107 0.107209 0.095997 0.088072 0.089502 0.068218 0.106314 0.104021 0.118171 0.110284 0.094940 0.083509 0.098540 0.088742 0.105721 0.116304 0.124890 0.140744 0.140908 0.158797 0.156507 0.144148 0.156483 0.156680 0.163507 0.157417
qa: -0.2717 -0.4522 -0.3305 0.1111 -0.0385 -0.0691 -0.2727 -0.2875 -0.2551 0.3728 -0.0360 -0.2495 -0.2620 0.0726 0.0516 -0.3288 -0.1866 0.2816 -0.1336 -0.1845 0.2921 -0.2476 -0.1866 -0.1244 -0.1622 -0.1886 0.1101 0.1072 0.0960 0.0881 0.0895 0.0682 0.1063 0.1040 0.1182 0.1103 0.0949 0.0835 0.0985 0.0887 0.1057 0.1163 0.1249 0.1407 0.1409 0.1588 0.1565 0.1441 0.1565 0.1567 0.1635 0.1574
va: 2.1307 2.0394 2.0684 3.6622 3.8269 3.8684 3.8978 3.9386 3.8178 4.1709 3.7033 3.9282 3.9364 3.8231 3.5714 4.0049 3.9474 3.7260 3.9032 3.9345 3.7158 3.9967 3.8985 3.8972 3.9041 3.9242 1.0056 1.0120 1.0023 1.0042 1.0028 0.9841 1.0069 1.0025 1.0225 0.9994 1.0055 0.9964 0.9975 1.0075 1.0006 1.0061 0.9957 1.0155 1.0086 0.9900 0.9952 1.0091 0.9892 0.9888 0.9890 0.9913
dispcorr: -0.029226693 hartree
energy: -1117.890718483283
dipole: -10.79139 10.94816 0.15677 -16.35392 15.55341 -0.80051 11.04705 -11.19546 -0.14841
magnitude: 0.82911 au
magnitude: 2.10742 debye
