program: Orca
programVersion: 5.0.2
elementType: O O O C C C C C C C C C C C C C C C C C C C C C C C H H H H H H H H H H H H H H H H H H H H H H H H H H
charge: 0
multiplicity: 1
keywords: wb97x-d3
keywords: def2-TZVPP
keywords: def2/J RIJCOSX
keywords: DEFGRID2
keywords: scfconv7
keywords: smallprint printgap noloewdin
keywords: NOSOSCF
formula: C23H26O3
InChI: InChI=1/C23H26O3/c1-16(2)13-20-21(23(20,3)4)22(24)25-15-17-9-8-12-19(14-17)26-18-10-6-5-7-11-18/h5-14,20-21H,15H2,1-4H3
52 atoms
O  -2.144288 2.091547 0.337085
O  -2.577858 0.769904 -1.40735
O  2.906529 1.10962 0.900039
C  -4.637133 -0.649505 0.427426
C  -3.337706 -1.293958 0.759872
C  -3.451417 0.235944 0.764913
C  -5.707505 -0.684082 1.493628
C  -5.20848 -0.713616 -0.967599
C  -2.502723 -2.002498 -0.240313
C  -2.706642 1.02016 -0.232827
C  -1.184102 -2.178452 -0.123598
C  -0.392576 -2.895906 -1.172718
C  -0.386986 -1.634092 1.021401
C  -1.352832 2.94217 -0.496894
C  -0.025193 2.330991 -0.848108
C  0.844775 1.94092 0.165098
C  0.351533 2.161067 -2.174611
C  2.083813 1.403597 -0.149913
C  1.59716 1.630168 -2.479422
C  2.474028 1.25024 -1.475438
C  3.731571 0.020572 0.874038
C  3.35505 -1.195872 0.316129
C  4.961684 0.157423 1.503498
C  4.224549 -2.274478 0.393816
C  5.816229 -0.932369 1.581116
C  5.455037 -2.151769 1.024901
H  -3.267081 -1.691358 1.769183
H  -3.477502 0.691103 1.748245
H  -6.290136 -1.604913 1.42174
H  -6.398425 0.154475 1.384473
H  -5.285727 -0.637945 2.498768
H  -4.461839 -0.766277 -1.754072
H  -5.835176 0.158384 -1.164884
H  -5.843493 -1.597467 -1.057936
H  -3.004582 -2.404269 -1.115339
H  -1.020691 -3.264687 -1.983879
H  0.149023 -3.746245 -0.750039
H  0.361884 -2.234368 -1.608732
H  0.2103 -0.77666 0.698111
H  0.317271 -2.378477 1.399899
H  -1.002185 -1.302866 1.856531
H  -1.209705 3.845027 0.096919
H  -1.902195 3.222134 -1.397815
H  0.569354 2.062847 1.206681
H  -0.324421 2.448183 -2.97017
H  1.893244 1.509247 -3.513415
H  3.446863 0.847993 -1.727884
H  2.394908 -1.312639 -0.170451
H  5.241922 1.10997 1.935817
H  3.928013 -3.22158 -0.038436
H  6.772467 -0.822015 2.076195
H  6.124913 -2.999394 1.084467
elementType: O C H
totalener: -1117.86571063 hartree
nucrepener: 2316.54382264 hartree
electener: -3434.40953327 hartree
oneelecener: -6123.04862474 hartree
twoeener: 2688.63909147 hartree
cpcmener: -0.02585632 hartree
kineticenergy: 1112.81131585 hartree
xcener: -110.230024238978 hartree
chargesum: -0.0000000
charge: -0.293489 -0.462780 -0.329840 0.136270 -0.026464 -0.107123 -0.262844 -0.298503 -0.255671 0.389960 0.012277 -0.243281 -0.288414 0.097064 0.042945 -0.327516 -0.190245 0.299277 -0.144450 -0.192597 0.317267 -0.200162 -0.242475 -0.171460 -0.127415 -0.175876 0.108144 0.089774 0.093454 0.095147 0.085901 0.093773 0.100244 0.097897 0.121742 0.095357 0.097659 0.093319 0.076404 0.109836 0.103858 0.123979 0.111696 0.133250 0.140960 0.158229 0.154703 0.145730 0.143663 0.156519 0.156879 0.157432
qa: -0.2935 -0.4628 -0.3298 0.1363 -0.0265 -0.1071 -0.2628 -0.2985 -0.2557 0.3900 0.0123 -0.2433 -0.2884 0.0971 0.0429 -0.3275 -0.1902 0.2993 -0.1445 -0.1926 0.3173 -0.2002 -0.2425 -0.1715 -0.1274 -0.1759 0.1081 0.0898 0.0935 0.0951 0.0859 0.0938 0.1002 0.0979 0.1217 0.0954 0.0977 0.0933 0.0764 0.1098 0.1039 0.1240 0.1117 0.1333 0.1410 0.1582 0.1547 0.1457 0.1437 0.1565 0.1569 0.1574
va: 2.1104 2.0301 2.0735 3.7467 3.8180 3.8375 3.8991 3.8946 3.8391 4.1180 3.6448 3.9332 3.9655 3.8051 3.5949 3.9778 3.9480 3.6880 3.9089 3.9031 3.6469 3.8849 3.9966 3.9434 3.8923 3.9007 1.0069 1.0317 1.0025 1.0027 1.0045 1.0183 1.0003 0.9985 1.0014 1.0089 0.9973 0.9947 0.9946 1.0008 1.0109 0.9926 1.0083 1.0262 1.0072 0.9909 0.9966 0.9900 1.0094 0.9924 0.9893 0.9902
dispcorr: -0.028146647 hartree
energy: -1117.893857279602
dipole: -16.89971 17.03178 0.13206 -14.19711 14.02079 -0.17632 0.15123 0.33235 0.48358
magnitude: 0.53139 au
magnitude: 1.35070 debye
