program: Orca
programVersion: 5.0.2
elementType: O O O C C C C C C C C C C C C C C C C C C C C C C C H H H H H H H H H H H H H H H H H H H H H H H H H H
charge: 0
multiplicity: 1
keywords: wb97x-d3
keywords: def2-TZVPP
keywords: def2/J RIJCOSX
keywords: DEFGRID2
keywords: scfconv7
keywords: smallprint printgap noloewdin
keywords: NOSOSCF
formula: C23H26O3
InChI: InChI=1/C23H26O3/c1-16(2)13-20-21(23(20,3)4)22(24)25-15-17-9-8-12-19(14-17)26-18-10-6-5-7-11-18/h5-14,20-21H,15H2,1-4H3
52 atoms
O  -2.137272 2.057768 0.305354
O  -2.552483 0.733316 -1.445286
O  2.935949 1.199989 0.907599
C  -4.593559 -0.722799 0.363673
C  -3.287322 -1.335355 0.732262
C  -3.436581 0.188681 0.719584
C  -5.69001 -0.782494 1.402528
C  -5.124939 -0.814077 -1.046083
C  -2.412144 -2.030614 -0.240929
C  -2.687933 0.97986 -0.277534
C  -1.093899 -2.16166 -0.095007
C  -0.259479 -2.861769 -1.122167
C  -0.33839 -1.5704 1.055388
C  -1.36739 2.910932 -0.53432
C  -0.015414 2.343218 -0.86695
C  0.851622 1.972424 0.155296
C  0.390624 2.206703 -2.186634
C  2.116343 1.491726 -0.143426
C  1.663742 1.739167 -2.477781
C  2.537063 1.383248 -1.464047
C  3.683295 0.061269 0.917874
C  3.297278 -1.111482 0.279001
C  4.856917 0.098626 1.660179
C  4.095603 -2.240318 0.38805
C  5.640234 -1.038821 1.764955
C  5.268388 -2.213572 1.127056
H  -3.237663 -1.733307 1.743079
H  -3.492619 0.658272 1.695003
H  -5.296584 -0.726383 2.418593
H  -6.247266 -1.717144 1.316515
H  -6.396763 0.039274 1.274486
H  -4.350964 -0.79969 -1.806492
H  -5.801779 0.017205 -1.250752
H  -5.697678 -1.737067 -1.157779
H  -2.882579 -2.45426 -1.121539
H  0.314546 -3.679181 -0.678398
H  0.462364 -2.171076 -1.567198
H  -0.863388 -3.272113 -1.930332
H  0.420221 -2.259088 1.432742
H  -0.979236 -1.287967 1.888462
H  0.189406 -0.667943 0.735549
H  -1.2569 3.832008 0.039636
H  -1.913434 3.149662 -1.449593
H  0.5537 2.060833 1.193278
H  -0.290387 2.460838 -2.988135
H  1.981083 1.647135 -3.508084
H  3.532051 1.026627 -1.696946
H  2.381358 -1.154652 -0.295083
H  5.143334 1.017439 2.154849
H  3.788325 -3.150763 -0.109811
H  6.551517 -1.001929 2.347173
H  5.884239 -3.098784 1.207757
totalener: -1117.84257572 hartree
nucrepener: 2323.84978953 hartree
electener: -3441.69236525 hartree
oneelecener: -6136.57627011 hartree
twoeener: 2694.88390486 hartree
kineticenergy: 1112.86516578 hartree
xcener: -110.236176816296 hartree
chargesum: -0.0000000
charge: -0.274732 -0.376826 -0.300157 0.137132 -0.060044 -0.105377 -0.241938 -0.280774 -0.162663 0.349036 0.037393 -0.240960 -0.282270 0.066088 0.049874 -0.307662 -0.119183 0.255862 -0.115398 -0.166198 0.310482 -0.184687 -0.216770 -0.143684 -0.092011 -0.140200 0.087926 0.078866 0.070290 0.087543 0.090047 0.104459 0.085632 0.087588 0.082817 0.086299 0.090950 0.083741 0.101927 0.093201 0.073882 0.110232 0.097046 0.125935 0.107839 0.126527 0.132972 0.103798 0.123312 0.124578 0.124143 0.124117
qa: -0.2747 -0.3768 -0.3002 0.1371 -0.0600 -0.1054 -0.2419 -0.2808 -0.1627 0.3490 0.0374 -0.2410 -0.2823 0.0661 0.0499 -0.3077 -0.1192 0.2559 -0.1154 -0.1662 0.3105 -0.1847 -0.2168 -0.1437 -0.0920 -0.1402 0.0879 0.0789 0.0703 0.0875 0.0900 0.1045 0.0856 0.0876 0.0828 0.0863 0.0910 0.0837 0.1019 0.0932 0.0739 0.1102 0.0970 0.1259 0.1078 0.1265 0.1330 0.1038 0.1233 0.1246 0.1241 0.1241
va: 2.1152 2.1106 2.1091 3.7428 3.8940 3.8335 3.9023 3.9101 3.8752 4.1619 3.6730 3.9496 3.9688 3.8672 3.6610 3.9871 3.9923 3.7898 3.9489 3.9392 3.7393 3.9147 4.0306 3.9951 3.9418 3.9647 1.0077 1.0327 1.0073 1.0049 1.0051 1.0211 1.0045 0.9979 1.0133 0.9982 0.9947 1.0142 1.0030 1.0128 1.0011 0.9899 1.0111 1.0275 1.0164 1.0008 1.0025 1.0126 1.0156 1.0013 0.9988 1.0003
dispcorr: -0.028454248 hartree
energy: -1117.871029966306
dipole: -16.69072 16.69961 0.00889 -14.47592 14.39361 -0.08232 0.06473 0.14142 0.20615
magnitude: 0.22215 au
magnitude: 0.56467 debye
