program: Orca
programVersion: 5.0.2
elementType: O O O C C C C C C C C C C C C C C C C C C C C C C C H H H H H H H H H H H H H H H H H H H H H H H H H H
charge: 0
multiplicity: 1
keywords: wb97x-d3
keywords: def2-TZVPP
keywords: def2/J RIJCOSX
keywords: DEFGRID2
keywords: scfconv7
keywords: smallprint printgap noloewdin
keywords: NOSOSCF
formula: C23H26O3
InChI: InChI=1/C23H26O3/c1-16(2)13-20-21(23(20,3)4)22(24)25-15-17-9-8-12-19(14-17)26-18-10-6-5-7-11-18/h5-14,20-21H,15H2,1-4H3
52 atoms
O  -1.694859 2.151135 0.083059
O  -1.973446 0.703849 -1.593101
O  3.324893 1.262584 0.180066
C  -3.571749 -0.982217 0.496439
C  -2.154825 -1.431209 0.684927
C  -2.484791 0.058728 0.668571
C  -4.50523 -1.139075 1.673884
C  -4.257098 -1.194539 -0.830211
C  -1.378489 -2.096711 -0.381056
C  -2.038969 0.955165 -0.418891
C  -0.861869 -3.326757 -0.304747
C  -0.081326 -3.902938 -1.448218
C  -1.006859 -4.246521 0.870548
C  -1.120748 3.082144 -0.826503
C  0.265349 2.680336 -1.250665
C  1.147342 2.155407 -0.315185
C  0.678535 2.851245 -2.564711
C  2.424051 1.776369 -0.704796
C  1.968801 2.506455 -2.935752
C  2.845363 1.957383 -2.014413
C  2.921354 0.356916 1.117746
C  1.964184 -0.617599 0.858583
C  3.550979 0.410851 2.353818
C  1.64173 -1.53119 1.849628
C  3.224995 -0.516214 3.331237
C  2.26635 -1.488651 3.087352
H  -1.9245 -1.773915 1.688466
H  -2.452512 0.532199 1.642845
H  -5.311121 -0.403791 1.634466
H  -3.989473 -1.014193 2.627037
H  -4.960217 -2.13125 1.671893
H  -5.065691 -0.47355 -0.962998
H  -4.697664 -2.192766 -0.850844
H  -3.592993 -1.107481 -1.683885
H  -1.229209 -1.545182 -1.301072
H  0.937857 -4.152161 -1.141109
H  -0.018433 -3.213803 -2.289231
H  -0.534317 -4.830847 -1.806691
H  -1.567297 -5.140459 0.584664
H  -1.524369 -3.800802 1.717416
H  -0.030992 -4.595926 1.217962
H  -1.094863 4.022783 -0.27439
H  -1.761573 3.223219 -1.699854
H  0.835833 2.02335 0.713838
H  -0.01233 3.238971 -3.302371
H  2.28917 2.641052 -3.960367
H  3.846336 1.663905 -2.301424
H  1.466484 -0.673229 -0.101313
H  4.294232 1.175145 2.539317
H  0.892472 -2.28166 1.636146
H  3.720773 -0.470439 4.291969
H  2.009946 -2.207905 3.853437
totalener: -1117.84553225 hartree
nucrepener: 2352.61152049 hartree
electener: -3470.45705274 hartree
oneelecener: -6194.01609530 hartree
twoeener: 2723.55904256 hartree
kineticenergy: 1112.85385905 hartree
xcener: -110.236180865675 hartree
chargesum: -0.0000000
charge: -0.278444 -0.387208 -0.302332 0.127273 0.008114 -0.085213 -0.242692 -0.256272 -0.292633 0.328941 -0.015991 -0.216535 -0.256549 0.074021 0.067053 -0.242866 -0.174063 0.253894 -0.080634 -0.222720 0.290253 -0.234430 -0.237151 -0.015337 -0.054652 -0.223660 0.081774 0.084217 0.090445 0.071705 0.087191 0.087476 0.083315 0.105862 0.132170 0.085012 0.084819 0.087274 0.104088 0.087041 0.084771 0.106196 0.100016 0.129116 0.103467 0.123559 0.123920 0.140824 0.122312 0.121203 0.123060 0.118998
qa: -0.2784 -0.3872 -0.3023 0.1273 0.0081 -0.0852 -0.2427 -0.2563 -0.2926 0.3289 -0.0160 -0.2165 -0.2565 0.0740 0.0671 -0.2429 -0.1741 0.2539 -0.0806 -0.2227 0.2903 -0.2344 -0.2372 -0.0153 -0.0547 -0.2237 0.0818 0.0842 0.0904 0.0717 0.0872 0.0875 0.0833 0.1059 0.1322 0.0850 0.0848 0.0873 0.1041 0.0870 0.0848 0.1062 0.1000 0.1291 0.1035 0.1236 0.1239 0.1408 0.1223 0.1212 0.1231 0.1190
va: 2.1187 2.0947 2.1152 3.7929 3.7814 3.9348 3.9046 3.9201 3.8407 4.1583 3.7232 3.9367 3.9291 3.8644 3.6583 3.9479 4.0298 3.8112 3.9373 4.0575 3.7988 3.9577 4.0576 3.8152 3.9032 4.0454 1.0102 1.0298 1.0051 1.0081 1.0044 1.0029 1.0032 1.0193 1.0206 0.9980 1.0112 0.9993 0.9998 1.0113 0.9973 0.9883 1.0107 1.0205 1.0133 0.9994 1.0129 1.0045 1.0153 0.9821 0.9985 1.0055
dispcorr: -0.027921388 hartree
energy: -1117.873453635423
dipole: -17.72722 17.24810 -0.47912 -21.83402 21.63375 -0.20027 2.54998 -2.05733 0.49266
magnitude: 0.71580 au
magnitude: 1.81942 debye
