program: Orca
programVersion: 5.0.2
elementType: O O O C C C C C C C C C C C C C C C C C C C C C C C H H H H H H H H H H H H H H H H H H H H H H H H H H
charge: 0
multiplicity: 1
keywords: wb97x-d3
keywords: def2-TZVPP
keywords: def2/J RIJCOSX
keywords: DEFGRID2
keywords: scfconv7
keywords: smallprint printgap noloewdin
keywords: NOSOSCF
formula: C23H26O3
InChI: InChI=1/C23H26O3/c1-16(2)13-20-21(23(20,3)4)22(24)25-15-17-9-8-12-19(14-17)26-18-10-6-5-7-11-18/h5-14,20-21H,15H2,1-4H3
52 atoms
O  -1.972909 1.003213 1.38751
O  -0.888383 -0.544061 2.585469
O  3.202713 1.041842 -0.100675
C  -3.665072 -1.128954 0.113328
C  -2.344652 -1.403283 -0.545077
C  -2.441758 -1.283725 0.982068
C  -4.62438 -2.296815 0.185162
C  -4.386932 0.181636 -0.089597
C  -1.623454 -0.40926 -1.35829
C  -1.690343 -0.254631 1.737675
C  -0.832364 -0.66046 -2.406433
C  -0.152846 0.467462 -3.125583
C  -0.519348 -2.019167 -2.955812
C  -1.160637 2.060109 1.908166
C  -0.049415 2.370281 0.946339
C  1.084051 1.565542 0.919326
C  -0.169985 3.420882 0.044301
C  2.069814 1.792016 -0.031329
C  0.837571 3.663005 -0.87768
C  1.953471 2.845142 -0.929523
C  3.157478 -0.306741 0.113979
C  4.269267 -0.881897 0.712597
C  2.085996 -1.095956 -0.28605
C  4.30866 -2.253212 0.909209
C  2.135861 -2.464346 -0.071254
C  3.242109 -3.051464 0.523894
H  -2.208194 -2.429955 -0.865565
H  -2.361908 -2.234902 1.495769
H  -4.106053 -3.246328 0.326428
H  -5.207238 -2.372964 -0.734469
H  -5.323785 -2.177046 1.014606
H  -5.053138 0.090179 -0.949227
H  -3.735054 1.028671 -0.270423
H  -5.00221 0.417428 0.780009
H  -1.737847 0.629932 -1.076475
H  -0.467286 0.514626 -4.171654
H  0.931902 0.330104 -3.132984
H  -0.358722 1.431757 -2.662797
H  -1.017249 -2.834014 -2.434991
H  0.556845 -2.208052 -2.915112
H  -0.803488 -2.081727 -4.00907
H  -0.777925 1.801565 2.895434
H  -1.829008 2.914682 2.011447
H  1.187046 0.757803 1.633005
H  -1.050112 4.05177 0.062337
H  0.74733 4.486564 -1.573521
H  2.736174 3.016653 -1.656591
H  5.095216 -0.253475 1.018391
H  1.208255 -0.65847 -0.744717
H  5.17759 -2.696883 1.376916
H  1.293323 -3.072315 -0.373748
H  3.271429 -4.119749 0.688949
totalener: -1117.84140227 hartree
nucrepener: 2404.56923254 hartree
electener: -3522.41063481 hartree
oneelecener: -6297.73753509 hartree
twoeener: 2775.32690028 hartree
kineticenergy: 1112.86047835 hartree
xcener: -110.238117942129 hartree
chargesum: 0.0000000
charge: -0.262673 -0.369486 -0.299801 0.113271 0.020962 -0.092868 -0.248719 -0.236357 -0.193874 0.341596 -0.060964 -0.223034 -0.258796 0.010100 0.000532 -0.171162 -0.180249 0.272186 -0.098488 -0.227205 0.219300 -0.179711 -0.071086 -0.108889 -0.163863 -0.124677 0.082796 0.086758 0.071636 0.088744 0.090321 0.083778 0.083543 0.090816 0.088565 0.100755 0.081895 0.079306 0.082987 0.085049 0.099405 0.125652 0.092930 0.155296 0.107854 0.124938 0.122598 0.122737 0.078964 0.121845 0.123038 0.121749
qa: -0.2627 -0.3695 -0.2998 0.1133 0.0210 -0.0929 -0.2487 -0.2364 -0.1939 0.3416 -0.0610 -0.2230 -0.2588 0.0101 0.0005 -0.1712 -0.1802 0.2722 -0.0985 -0.2272 0.2193 -0.1797 -0.0711 -0.1089 -0.1639 -0.1247 0.0828 0.0868 0.0716 0.0887 0.0903 0.0838 0.0835 0.0908 0.0886 0.1008 0.0819 0.0793 0.0830 0.0850 0.0994 0.1257 0.0929 0.1553 0.1079 0.1249 0.1226 0.1227 0.0790 0.1218 0.1230 0.1217
va: 2.0981 2.1240 2.1234 3.7358 3.7519 3.8298 3.9115 3.9108 3.8643 4.2259 3.8055 3.9283 3.9381 3.8857 3.6364 3.8646 3.9774 3.7956 3.9050 4.0093 3.8644 4.0057 3.8242 3.9619 4.0152 3.9667 1.0070 1.0277 1.0087 1.0039 1.0044 1.0029 1.0163 1.0046 1.0129 1.0015 0.9969 1.0107 1.0130 0.9997 1.0037 1.0124 1.0022 1.0149 1.0117 0.9990 1.0147 1.0148 1.0299 0.9995 1.0008 1.0010
dispcorr: -0.031168571 hartree
energy: -1117.872570842348
dipole: -17.96388 17.25666 -0.70722 -8.43082 8.55017 0.11935 -13.64695 12.93266 -0.71429
magnitude: 1.01223 au
magnitude: 2.57289 debye
