program: Orca
programVersion: 5.0.2
elementType: O O O C C C C C C C C C C C C C C C C C C C C C C C H H H H H H H H H H H H H H H H H H H H H H H H H H
charge: 0
multiplicity: 1
keywords: wb97x-d3
keywords: def2-TZVPP
keywords: def2/J RIJCOSX
keywords: DEFGRID2
keywords: scfconv7
keywords: smallprint printgap noloewdin
keywords: NOSOSCF
formula: C23H26O3
InChI: InChI=1/C23H26O3/c1-16(2)13-20-21(23(20,3)4)22(24)25-15-17-9-8-12-19(14-17)26-18-10-6-5-7-11-18/h5-14,20-21H,15H2,1-4H3
52 atoms
O  -1.160268 -0.043115 1.987657
O  -2.727923 1.232221 1.027705
O  3.688867 0.951869 -0.213784
C  -4.202084 -1.389149 0.323944
C  -3.149631 -1.269632 -0.724715
C  -2.771999 -1.150205 0.755811
C  -4.726256 -2.778955 0.607496
C  -5.263277 -0.327094 0.479087
C  -3.066228 -0.108892 -1.644801
C  -2.265783 0.145503 1.251411
C  -1.94414 0.33683 -2.209379
C  -1.949903 1.509431 -3.140358
C  -0.594212 -0.254329 -1.943972
C  -0.455371 1.122486 2.41479
C  0.428851 1.653589 1.320934
C  1.64237 1.025016 1.063416
C  0.04285 2.746357 0.553014
C  2.462119 1.486968 0.042559
C  0.872316 3.205683 -0.458915
C  2.077443 2.576976 -0.725923
C  3.890489 -0.394686 -0.138457
C  2.963415 -1.316209 -0.610543
C  5.105061 -0.821723 0.379432
C  3.263245 -2.668441 -0.555624
C  5.394765 -2.176453 0.419137
C  4.475355 -3.106483 -0.04276
H  -2.823313 -2.211792 -1.15859
H  -2.256228 -2.007539 1.173102
H  -5.121411 -2.849478 1.622362
H  -3.952295 -3.540174 0.498841
H  -5.533954 -3.030184 -0.082406
H  -4.914361 0.674791 0.251424
H  -5.642189 -0.317958 1.502378
H  -6.104346 -0.555239 -0.178838
H  -3.99585 0.400197 -1.876656
H  -1.547677 1.240028 -4.120223
H  -1.316525 2.310105 -2.750104
H  -2.951217 1.912428 -3.286276
H  0.06687 0.501576 -1.511893
H  -0.124484 -0.587862 -2.873034
H  -0.626057 -1.099212 -1.258355
H  0.143213 0.791161 3.263332
H  -1.146907 1.88977 2.765818
H  1.950003 0.178714 1.666756
H  -0.90711 3.226992 0.740619
H  0.573885 4.058199 -1.054779
H  2.727274 2.928473 -1.516465
H  2.019142 -0.985391 -1.023331
H  5.816173 -0.090095 0.739791
H  2.54136 -3.384386 -0.925765
H  6.344295 -2.504729 0.8208
H  4.702334 -4.163218 -0.006727
totalener: -1117.84430199 hartree
nucrepener: 2334.07798096 hartree
electener: -3451.92228294 hartree
oneelecener: -6156.94374633 hartree
twoeener: 2705.02146339 hartree
kineticenergy: 1112.86318657 hartree
xcener: -110.235888654053 hartree
chargesum: -0.0000000
charge: -0.264539 -0.388194 -0.299456 0.141300 -0.061600 -0.115926 -0.243734 -0.281124 -0.177166 0.357490 -0.004093 -0.211160 -0.219195 0.041649 -0.014411 -0.173719 -0.107808 0.212279 -0.149130 -0.166593 0.172384 -0.076691 -0.169714 -0.181350 -0.115739 -0.114097 0.092819 0.083057 0.089709 0.069953 0.088226 0.106269 0.085147 0.086420 0.082688 0.084627 0.083233 0.078745 0.040956 0.109089 0.087386 0.106131 0.107605 0.118611 0.122566 0.127982 0.124560 0.137908 0.125141 0.122664 0.124419 0.124425
qa: -0.2645 -0.3882 -0.2995 0.1413 -0.0616 -0.1159 -0.2437 -0.2811 -0.1772 0.3575 -0.0041 -0.2112 -0.2192 0.0416 -0.0144 -0.1737 -0.1078 0.2123 -0.1491 -0.1666 0.1724 -0.0767 -0.1697 -0.1814 -0.1157 -0.1141 0.0928 0.0831 0.0897 0.0700 0.0882 0.1063 0.0851 0.0864 0.0827 0.0846 0.0832 0.0787 0.0410 0.1091 0.0874 0.1061 0.1076 0.1186 0.1226 0.1280 0.1246 0.1379 0.1251 0.1227 0.1244 0.1244
va: 2.1209 2.0944 2.1108 3.7328 3.8887 3.8279 3.9040 3.9074 3.9014 4.1667 3.7814 3.9424 3.9173 3.8827 3.6734 3.9367 3.8799 3.8527 3.9363 3.9516 3.8846 3.8621 3.9967 4.0157 3.9587 3.9347 1.0057 1.0314 1.0053 1.0072 1.0045 1.0198 1.0052 0.9977 1.0103 0.9990 0.9999 1.0117 1.0149 1.0014 1.0037 0.9957 1.0107 1.0143 1.0247 1.0009 1.0128 0.9763 1.0141 1.0032 0.9995 1.0006
dispcorr: -0.028826367 hartree
energy: -1117.873128353432
dipole: -20.81019 20.91797 0.10777 -6.98245 6.37986 -0.60259 -8.36445 8.41911 0.05466
magnitude: 0.61458 au
magnitude: 1.56215 debye
