program: Orca
programVersion: 5.0.2
elementType: O O O C C C C C C C C C C C C C C C C C C C C C C C H H H H H H H H H H H H H H H H H H H H H H H H H H
charge: 0
multiplicity: 1
keywords: wb97x-d3
keywords: def2-TZVPP
keywords: def2/J RIJCOSX
keywords: DEFGRID2
keywords: scfconv7
keywords: smallprint printgap noloewdin
keywords: NOSOSCF
formula: C23H26O3
InChI: InChI=1/C23H26O3/c1-16(2)13-20-21(23(20,3)4)22(24)25-15-17-9-8-12-19(14-17)26-18-10-6-5-7-11-18/h5-14,20-21H,15H2,1-4H3
52 atoms
O  -1.47496 2.135207 0.841341
O  -2.168978 1.144895 -1.034498
O  3.399124 1.08387 -0.269394
C  -3.493333 -0.944817 0.862114
C  -2.096831 -1.462449 0.69594
C  -2.328642 -0.001397 1.075016
C  -4.230589 -1.348371 2.117708
C  -4.399421 -0.826464 -0.338218
C  -1.543935 -1.871776 -0.611225
C  -2.00465 1.11083 0.156354
C  -1.096887 -3.094078 -0.914485
C  -0.54137 -3.388587 -2.27596
C  -1.106383 -4.267845 0.018374
C  -1.001205 3.236562 0.075181
C  0.2469 2.90253 -0.694869
C  1.244223 2.141902 -0.098382
C  0.420603 3.371201 -1.989724
C  2.392881 1.826773 -0.810913
C  1.589684 3.086821 -2.678171
C  2.576417 2.304817 -2.100872
C  3.104219 0.020221 0.534156
C  3.94717 -0.210054 1.61255
C  2.040125 -0.837366 0.278243
C  3.724851 -1.303159 2.436138
C  1.822884 -1.917583 1.118447
C  2.658643 -2.157742 2.199071
H  -1.730056 -2.038983 1.539064
H  -2.107512 0.228744 2.110641
H  -3.561224 -1.45102 2.973064
H  -4.733507 -2.30653 1.974376
H  -4.990883 -0.609822 2.378597
H  -5.166552 -0.069383 -0.166345
H  -4.906394 -1.779722 -0.497986
H  -3.880625 -0.569248 -1.255753
H  -1.509701 -1.11965 -1.389872
H  -0.580623 -2.519115 -2.93059
H  -1.091079 -4.199764 -2.760009
H  0.500599 -3.713444 -2.211873
H  -0.106389 -4.698578 0.117122
H  -1.74288 -5.062538 -0.379244
H  -1.471451 -4.033114 1.016167
H  -0.79907 4.014906 0.81252
H  -1.777108 3.606278 -0.599076
H  1.119927 1.779119 0.91452
H  -0.363324 3.945628 -2.466568
H  1.72381 3.453852 -3.687069
H  3.480347 2.057214 -2.641329
H  4.772044 0.465562 1.797283
H  1.377026 -0.6720 -0.561514
H  4.386472 -1.478781 3.274218
H  0.986747 -2.572539 0.913615
H  2.481425 -3.004307 2.848609
totalener: -1117.84532186 hartree
nucrepener: 2354.07903621 hartree
electener: -3471.92435806 hartree
oneelecener: -6196.95084161 hartree
twoeener: 2725.02648355 hartree
kineticenergy: 1112.85008338 hartree
xcener: -110.235430610451 hartree
chargesum: -0.0000000
charge: -0.278335 -0.386761 -0.302630 0.128135 0.006978 -0.083245 -0.244068 -0.255899 -0.295010 0.328122 -0.014499 -0.218151 -0.255465 0.073858 0.066769 -0.243955 -0.174806 0.257483 -0.081236 -0.224001 0.287910 -0.235765 -0.233196 -0.055878 -0.011065 -0.224155 0.080788 0.084079 0.072102 0.087642 0.090393 0.087090 0.083035 0.106488 0.131782 0.084917 0.087472 0.085610 0.085216 0.103703 0.087263 0.106449 0.099312 0.128786 0.103358 0.123437 0.124140 0.123473 0.140958 0.122866 0.119253 0.119251
qa: -0.2783 -0.3868 -0.3026 0.1281 0.0070 -0.0832 -0.2441 -0.2559 -0.2950 0.3281 -0.0145 -0.2182 -0.2555 0.0739 0.0668 -0.2440 -0.1748 0.2575 -0.0812 -0.2240 0.2879 -0.2358 -0.2332 -0.0559 -0.0111 -0.2242 0.0808 0.0841 0.0721 0.0876 0.0904 0.0871 0.0830 0.1065 0.1318 0.0849 0.0875 0.0856 0.0852 0.1037 0.0873 0.1064 0.0993 0.1288 0.1034 0.1234 0.1241 0.1235 0.1410 0.1229 0.1193 0.1193
va: 2.1194 2.0950 2.1169 3.7907 3.7860 3.9317 3.9051 3.9201 3.8418 4.1591 3.7191 3.9365 3.9283 3.8644 3.6598 3.9420 4.0294 3.8096 3.9389 4.0546 3.8053 4.0575 3.9576 3.9021 3.8125 4.0489 1.0099 1.0297 1.0079 1.0044 1.0051 1.0031 1.0031 1.0192 1.0202 1.0113 0.9997 0.9980 0.9974 1.0002 1.0111 0.9882 1.0111 1.0207 1.0130 0.9993 1.0128 1.0145 1.0039 0.9985 0.9837 1.0054
dispcorr: -0.027988262 hartree
energy: -1117.873310117430
dipole: -18.43175 18.04536 -0.38639 -21.15861 20.85865 -0.29996 0.92526 -0.38782 0.53745
magnitude: 0.72672 au
magnitude: 1.84717 debye
