program: Orca
programVersion: 5.0.2
elementType: O O O C C C C C C C C C C C C C C C C C C C C C C C H H H H H H H H H H H H H H H H H H H H H H H H H H
charge: 0
multiplicity: 1
keywords: wb97x-d3
keywords: def2-TZVPP
keywords: def2/J RIJCOSX
keywords: DEFGRID2
keywords: scfconv7
keywords: smallprint printgap noloewdin
keywords: NOSOSCF
formula: C23H26O3
InChI: InChI=1/C23H26O3/c1-16(2)13-20-21(23(20,3)4)22(24)25-15-17-9-8-12-19(14-17)26-18-10-6-5-7-11-18/h5-14,20-21H,15H2,1-4H3
52 atoms
O  -1.747747 1.131254 -0.498654
O  -3.764042 1.69291 0.266833
O  3.330371 0.873106 0.021188
C  -2.702585 -1.663417 -1.048353
C  -2.546752 -1.675671 0.436496
C  -3.367471 -0.574591 -0.23676
C  -3.668251 -2.665403 -1.642502
C  -1.517661 -1.407622 -1.948442
C  -1.252059 -1.405299 1.112575
C  -2.998148 0.854818 -0.132031
C  -1.125365 -0.867345 2.326991
C  0.220312 -0.694106 2.96363
C  -2.287541 -0.405932 3.152818
C  -1.300526 2.471566 -0.322498
C  0.14519 2.530088 -0.718295
C  1.05462 1.635219 -0.16434
C  0.590775 3.494981 -1.611735
C  2.393103 1.703522 -0.521066
C  1.935397 3.568476 -1.945453
C  2.841649 2.668692 -1.412521
C  3.077591 -0.459322 0.148648
C  2.31823 -1.172626 -0.771475
C  3.66015 -1.108449 1.229317
C  2.135401 -2.535277 -0.591312
C  3.476373 -2.47258 1.3905
C  2.706814 -3.192369 0.488168
H  -3.172544 -2.395926 0.958461
H  -4.439904 -0.682107 -0.1200
H  -4.519354 -2.851703 -0.98632
H  -3.172658 -3.62186 -1.818754
H  -4.059473 -2.311072 -2.597831
H  -1.064498 -2.36349 -2.221168
H  -0.745974 -0.790804 -1.499154
H  -1.833335 -0.920701 -2.872369
H  -0.350083 -1.71632 0.593739
H  1.025655 -1.076629 2.337382
H  0.268861 -1.21505 3.923369
H  0.424109 0.359256 3.175286
H  -2.157189 0.634519 3.458944
H  -2.36017 -0.99071 4.073288
H  -3.240634 -0.478656 2.633743
H  -1.429119 2.771414 0.721529
H  -1.895859 3.158153 -0.929428
H  0.713711 0.88393 0.538765
H  -0.112839 4.191047 -2.050864
H  2.278065 4.322797 -2.64105
H  3.890143 2.708126 -1.676163
H  1.873035 -0.675141 -1.623258
H  4.251707 -0.540443 1.935252
H  1.540851 -3.08533 -1.309151
H  3.930716 -2.972545 2.235649
H  2.557275 -4.254938 0.621548
totalener: -1117.84174095 hartree
nucrepener: 2398.01760083 hartree
electener: -3515.85934178 hartree
oneelecener: -6284.38849176 hartree
twoeener: 2768.52914998 hartree
kineticenergy: 1112.85748037 hartree
xcener: -110.236936623555 hartree
chargesum: 0.0000000
charge: -0.255148 -0.363420 -0.298699 0.164779 -0.058753 -0.130832 -0.251542 -0.251880 -0.138918 0.323994 -0.076568 -0.159183 -0.235396 0.037543 0.020231 -0.144734 -0.158077 0.242095 -0.094130 -0.200569 0.262704 -0.175658 -0.215023 -0.118507 -0.082923 -0.146139 0.094232 0.090901 0.072840 0.085253 0.092117 0.085019 0.051682 0.097471 0.078567 0.030181 0.096452 0.087895 0.087281 0.097434 0.090059 0.109946 0.095050 0.061059 0.111613 0.124970 0.125735 0.138494 0.121824 0.129963 0.124174 0.124541
qa: -0.2551 -0.3634 -0.2987 0.1648 -0.0588 -0.1308 -0.2515 -0.2519 -0.1389 0.3240 -0.0766 -0.1592 -0.2354 0.0375 0.0202 -0.1447 -0.1581 0.2421 -0.0941 -0.2006 0.2627 -0.1757 -0.2150 -0.1185 -0.0829 -0.1461 0.0942 0.0909 0.0728 0.0853 0.0921 0.0850 0.0517 0.0975 0.0786 0.0302 0.0965 0.0879 0.0873 0.0974 0.0901 0.1099 0.0950 0.0611 0.1116 0.1250 0.1257 0.1385 0.1218 0.1300 0.1242 0.1245
va: 2.1063 2.1411 2.1244 3.6913 3.8414 3.8414 3.9121 3.9291 3.7886 4.2344 3.7877 3.8934 3.9366 3.8341 3.7659 3.8810 3.9751 3.7935 3.9594 4.0285 3.7862 3.8692 3.9788 3.8913 3.9049 3.9555 1.0078 1.0287 1.0082 1.0042 1.0037 0.9981 1.0091 1.0111 1.0020 1.0382 1.0045 1.0023 1.0025 0.9988 1.0127 0.9963 1.0117 1.0479 1.0110 1.0000 1.0130 0.9981 1.0166 1.0018 0.9990 1.0013
dispcorr: -0.031750960 hartree
energy: -1117.873491914631
dipole: -11.01291 11.50664 0.49374 -13.32130 12.68648 -0.63483 4.29834 -4.48895 -0.19062
magnitude: 0.82651 au
magnitude: 2.10082 debye
