program: Orca
programVersion: 5.0.2
elementType: O O O C C C C C C C C C C C C C C C C C C C C C C C H H H H H H H H H H H H H H H H H H H H H H H H H H
charge: 0
multiplicity: 1
keywords: wb97x-d3
keywords: def2-TZVPP
keywords: def2/J RIJCOSX
keywords: DEFGRID2
keywords: scfconv7
keywords: smallprint printgap noloewdin
keywords: NOSOSCF
formula: C23H26O3
InChI: InChI=1/C23H26O3/c1-16(2)13-20-21(23(20,3)4)22(24)25-15-17-9-8-12-19(14-17)26-18-10-6-5-7-11-18/h5-14,20-21H,15H2,1-4H3
52 atoms
O  -1.776916 1.120994 -0.416304
O  -3.764777 1.685175 0.41833
O  3.313254 0.865076 -0.132963
C  -2.739927 -1.681067 -0.895995
C  -2.510832 -1.676679 0.579246
C  -3.372608 -0.588783 -0.062776
C  -3.724681 -2.696376 -1.433692
C  -1.603399 -1.424231 -1.856406
C  -1.185364 -1.394235 1.188475
C  -3.009916 0.844467 0.004615
C  -0.999353 -0.821684 2.379237
C  0.375518 -0.642657 2.94846
C  -2.117704 -0.321134 3.241662
C  -1.327789 2.464447 -0.278991
C  0.099343 2.520806 -0.737746
C  1.031193 1.625473 -0.222833
C  0.506498 3.48502 -1.649953
C  2.353142 1.693545 -0.636629
C  1.835331 3.557439 -2.041626
C  2.763245 2.657906 -1.547109
C  3.071153 -0.467777 0.006707
C  3.703371 -1.112933 1.061709
C  2.275343 -1.185841 -0.878105
C  3.533058 -2.477495 1.232865
C  2.107287 -2.549183 -0.688505
C  2.728132 -3.202214 0.365878
H  -3.104776 -2.396319 1.138141
H  -4.437099 -0.703171 0.107646
H  -4.543521 -2.880773 -0.737274
H  -3.230407 -3.651243 -1.621809
H  -4.161235 -2.355806 -2.374161
H  -0.812984 -0.801173 -1.450306
H  -1.968346 -0.944573 -2.765807
H  -1.159422 -2.3794 -2.146146
H  -0.310096 -1.728501 0.638932
H  1.14834 -1.043628 2.293614
H  0.466121 -1.143501 3.915816
H  0.594772 0.413697 3.12771
H  -2.119087 -0.835512 4.205582
H  -3.09951 -0.449248 2.791332
H  -1.991301 0.741946 3.460427
H  -1.411908 2.778938 0.765353
H  -1.950939 3.141018 -0.86902
H  0.720452 0.87464 0.494551
H  -0.215136 4.181239 -2.058465
H  2.147889 4.310884 -2.75208
H  3.799378 2.696852 -1.85562
H  4.322752 -0.541277 1.740334
H  1.790962 -0.691965 -1.710342
H  4.026137 -2.973991 2.058142
H  1.484822 -3.103193 -1.379111
H  2.589992 -4.265398 0.506795
totalener: -1117.84170396 hartree
nucrepener: 2400.17176602 hartree
electener: -3518.01346998 hartree
oneelecener: -6288.69385368 hartree
twoeener: 2770.68038369 hartree
kineticenergy: 1112.86016800 hartree
xcener: -110.237802937847 hartree
chargesum: -0.0000000
charge: -0.254882 -0.362570 -0.298479 0.164175 -0.058822 -0.131742 -0.251858 -0.252316 -0.139285 0.323097 -0.077610 -0.161022 -0.233378 0.037064 0.020490 -0.139980 -0.158261 0.241756 -0.094621 -0.199718 0.265184 -0.216026 -0.178154 -0.081845 -0.119250 -0.145793 0.093871 0.091096 0.072885 0.085354 0.092288 0.051882 0.097582 0.084716 0.081744 0.031772 0.096580 0.087826 0.096436 0.090456 0.087940 0.109674 0.095283 0.056050 0.111326 0.124873 0.125882 0.121561 0.138207 0.124321 0.129611 0.124629
qa: -0.2549 -0.3626 -0.2985 0.1642 -0.0588 -0.1317 -0.2519 -0.2523 -0.1393 0.3231 -0.0776 -0.1610 -0.2334 0.0371 0.0205 -0.1400 -0.1583 0.2418 -0.0946 -0.1997 0.2652 -0.2160 -0.1782 -0.0818 -0.1193 -0.1458 0.0939 0.0911 0.0729 0.0854 0.0923 0.0519 0.0976 0.0847 0.0817 0.0318 0.0966 0.0878 0.0964 0.0905 0.0879 0.1097 0.0953 0.0560 0.1113 0.1249 0.1259 0.1216 0.1382 0.1243 0.1296 0.1246
va: 2.1054 2.1425 2.1246 3.6892 3.8413 3.8412 3.9128 3.9302 3.7891 4.2365 3.7879 3.8919 3.9361 3.8338 3.7675 3.8767 3.9755 3.7942 3.9601 4.0280 3.7820 3.9794 3.8719 3.9040 3.8919 3.9547 1.0081 1.0287 1.0082 1.0041 1.0037 1.0087 1.0112 0.9981 1.0007 1.0381 1.0048 1.0023 0.9994 1.0125 1.0023 0.9959 1.0119 1.0499 1.0111 1.0000 1.0130 1.0169 0.9982 0.9989 1.0018 1.0012
dispcorr: -0.031890254 hartree
energy: -1117.873594213292
dipole: -10.63688 11.12866 0.49179 -13.13249 12.50039 -0.63210 4.87283 -5.07563 -0.20280
magnitude: 0.82616 au
magnitude: 2.09993 debye
