program: Orca
programVersion: 5.0.2
elementType: O O O C C C C C C C C C C C C C C C C C C C C C C C H H H H H H H H H H H H H H H H H H H H H H H H H H
charge: 0
multiplicity: 1
keywords: wb97x-d3
keywords: def2-TZVPP
keywords: def2/J RIJCOSX
keywords: DEFGRID2
keywords: scfconv7
keywords: smallprint printgap noloewdin
keywords: NOSOSCF
formula: C23H26O3
InChI: InChI=1/C23H26O3/c1-16(2)13-20-21(23(20,3)4)22(24)25-15-17-9-8-12-19(14-17)26-18-10-6-5-7-11-18/h5-14,20-21H,15H2,1-4H3
52 atoms
O  -1.844813 1.834373 -1.124817
O  -1.316295 -0.319111 -1.437605
O  3.57037 1.163922 -0.825204
C  -3.764113 -0.794371 0.470229
C  -2.543948 -0.82826 1.335705
C  -2.748817 0.330304 0.375021
C  -5.074501 -0.42955 1.126498
C  -3.911545 -1.80045 -0.642713
C  -1.472574 -1.845368 1.174171
C  -1.894492 0.533365 -0.814459
C  -1.514152 -3.053105 1.739253
C  -0.39027 -4.029596 1.567083
C  -2.659394 -3.53898 2.575409
C  -1.016873 2.241723 -2.217448
C  0.346193 2.64624 -1.732314
C  1.327724 1.685869 -1.512066
C  0.627443 3.984268 -1.478797
C  2.568869 2.068668 -1.022301
C  1.876531 4.359216 -1.010384
C  2.84988 3.403295 -0.769045
C  3.338258 0.028676 -0.106494
C  2.387801 -0.04961 0.904808
C  4.145241 -1.063863 -0.396197
C  2.252818 -1.23047 1.619849
C  4.004539 -2.233063 0.332686
C  3.057271 -2.325283 1.342049
H  -2.71603 -0.530182 2.367354
H  -3.056426 1.260889 0.837303
H  -4.942032 0.291841 1.934029
H  -5.548849 -1.316945 1.551112
H  -5.769768 0.003167 0.405106
H  -4.551792 -1.406822 -1.434367
H  -4.386283 -2.703476 -0.253627
H  -2.964268 -2.091773 -1.085909
H  -0.607842 -1.588523 0.575065
H  -0.74654 -4.962059 1.122638
H  0.052582 -4.296014 2.530882
H  0.399925 -3.634275 0.93081
H  -3.070354 -4.464969 2.165574
H  -3.473366 -2.819627 2.644752
H  -2.329865 -3.772072 3.591439
H  -1.528923 3.095341 -2.661606
H  -0.953192 1.453265 -2.967936
H  1.121592 0.643218 -1.72035
H  -0.132136 4.73642 -1.652307
H  2.092833 5.401996 -0.819868
H  3.825664 3.68233 -0.393865
H  1.757088 0.797275 1.14121
H  4.880112 -0.986992 -1.186676
H  1.505909 -1.290142 2.400831
H  4.638635 -3.079366 0.103792
H  2.946887 -3.240632 1.907377
totalener: -1117.84438944 hartree
nucrepener: 2315.85980572 hartree
electener: -3433.70419516 hartree
oneelecener: -6120.63132370 hartree
twoeener: 2686.92712854 hartree
kineticenergy: 1112.85173279 hartree
xcener: -110.232754728522 hartree
chargesum: 0.0000000
charge: -0.264586 -0.404378 -0.300990 0.083360 -0.037447 -0.065483 -0.245820 -0.258284 -0.197907 0.340396 -0.024994 -0.240346 -0.248327 0.048587 0.001545 -0.165196 -0.181559 0.222304 -0.090900 -0.201442 0.268309 -0.152420 -0.219028 -0.147183 -0.079872 -0.171598 0.097997 0.084149 0.074191 0.083764 0.092958 0.090753 0.081620 0.113743 0.123006 0.091615 0.085414 0.089666 0.087573 0.075530 0.094689 0.097026 0.115671 0.150906 0.107269 0.124694 0.125332 0.128268 0.122339 0.139093 0.123626 0.132367
qa: -0.2646 -0.4044 -0.3010 0.0834 -0.0374 -0.0655 -0.2458 -0.2583 -0.1979 0.3404 -0.0250 -0.2403 -0.2483 0.0486 0.0015 -0.1652 -0.1816 0.2223 -0.0909 -0.2014 0.2683 -0.1524 -0.2190 -0.1472 -0.0799 -0.1716 0.0980 0.0841 0.0742 0.0838 0.0930 0.0908 0.0816 0.1137 0.1230 0.0916 0.0854 0.0897 0.0876 0.0755 0.0947 0.0970 0.1157 0.1509 0.1073 0.1247 0.1253 0.1283 0.1223 0.1391 0.1236 0.1324
va: 2.1346 2.0690 2.1112 3.7213 3.8508 3.8785 3.9021 3.9123 3.8624 4.1615 3.7148 3.9483 3.9447 3.8622 3.7132 3.9021 4.0278 3.8499 3.9402 4.0553 3.7962 3.8984 4.0411 3.9129 3.9456 3.9299 1.0023 1.0304 1.0078 1.0053 1.0055 1.0039 1.0005 1.0156 1.0040 1.0034 0.9941 1.0077 0.9999 1.0103 1.0021 0.9984 1.0147 1.0177 1.0118 0.9995 1.0119 1.0068 1.0150 0.9936 0.9982 0.9955
dispcorr: -0.027615350 hartree
energy: -1117.872004791735
dipole: -22.39564 21.72472 -0.67092 -19.39203 19.63707 0.24504 11.77647 -11.33398 0.44249
magnitude: 0.84022 au
magnitude: 2.13567 debye
