program: Orca
programVersion: 5.0.2
elementType: O O O C C C C C C C C C C C C C C C C C C C C C C C H H H H H H H H H H H H H H H H H H H H H H H H H H
charge: 0
multiplicity: 1
keywords: wb97x-d3
keywords: def2-TZVPP
keywords: def2/J RIJCOSX
keywords: DEFGRID2
keywords: scfconv7
keywords: smallprint printgap noloewdin
keywords: NOSOSCF
formula: C23H26O3
InChI: InChI=1/C23H26O3/c1-16(2)13-20-21(23(20,3)4)22(24)25-15-17-9-8-12-19(14-17)26-18-10-6-5-7-11-18/h5-14,20-21H,15H2,1-4H3
52 atoms
O  -1.499239 1.751766 1.528734
O  -2.53205 1.588977 -0.44313
O  3.307969 0.967086 -0.251276
C  -3.57357 -1.167199 0.477304
C  -2.129866 -1.482757 0.216819
C  -2.516518 -0.27479 1.076267
C  -4.287626 -2.055895 1.469845
C  -4.472364 -0.711187 -0.646713
C  -1.493512 -1.322186 -1.103604
C  -2.219751 1.096214 0.608471
C  -0.747892 -2.234081 -1.735094
C  -0.130827 -1.922341 -3.066376
C  -0.449825 -3.612014 -1.227197
C  -0.940718 2.999592 1.121329
C  0.151341 2.799427 0.107392
C  1.224687 1.974831 0.424893
C  0.089788 3.401927 -1.140839
C  2.218856 1.742534 -0.51418
C  1.103688 3.188072 -2.062259
C  2.16472 2.351192 -1.760975
C  3.19273 -0.168527 0.49508
C  2.099142 -1.022398 0.402972
C  4.259426 -0.478413 1.327784
C  2.083394 -2.182445 1.16258
C  4.234243 -1.649277 2.069054
C  3.144745 -2.504419 1.995901
H  -1.732087 -2.295736 0.814772
H  -2.33078 -0.409579 2.135818
H  -5.124144 -1.529109 1.932939
H  -3.626964 -2.393812 2.26988
H  -4.685889 -2.942964 0.974064
H  -3.965871 -0.12582 -1.405871
H  -5.292734 -0.10617 -0.257757
H  -4.907851 -1.586458 -1.131917
H  -1.638783 -0.372278 -1.604249
H  -0.367422 -0.913305 -3.401548
H  -0.470734 -2.622274 -3.834117
H  0.957749 -2.013944 -3.021408
H  -0.8388 -4.363074 -1.919342
H  -0.877263 -3.82465 -0.249315
H  0.628791 -3.777315 -1.167866
H  -0.545122 3.434905 2.039479
H  -1.712702 3.668192 0.734924
H  1.276786 1.504905 1.399832
H  -0.758601 4.021757 -1.398818
H  1.055433 3.657246 -3.03586
H  2.950569 2.164538 -2.480814
H  1.26369 -0.796573 -0.248768
H  5.103465 0.196435 1.384483
H  1.228326 -2.841863 1.092348
H  5.070168 -1.888092 2.713319
H  3.12425 -3.414314 2.580186
totalener: -1117.84467237 hartree
nucrepener: 2367.99208376 hartree
electener: -3485.83675614 hartree
oneelecener: -6224.75835461 hartree
twoeener: 2738.92159848 hartree
kineticenergy: 1112.85855759 hartree
xcener: -110.236063724099 hartree
chargesum: -0.0000000
charge: -0.269747 -0.384089 -0.300372 0.115159 0.027679 -0.079250 -0.244041 -0.248922 -0.234635 0.326758 -0.059064 -0.207089 -0.281130 0.061707 0.022664 -0.236421 -0.141140 0.270870 -0.082549 -0.226105 0.255634 -0.146481 -0.208052 -0.140416 -0.089477 -0.156275 0.077740 0.083012 0.089773 0.070432 0.088445 0.102896 0.088058 0.081085 0.117722 0.083546 0.090054 0.084263 0.102788 0.083919 0.089763 0.111310 0.099622 0.123629 0.106495 0.123525 0.123682 0.131789 0.123459 0.131748 0.123684 0.122346
qa: -0.2697 -0.3841 -0.3004 0.1152 0.0277 -0.0793 -0.2440 -0.2489 -0.2346 0.3268 -0.0591 -0.2071 -0.2811 0.0617 0.0227 -0.2364 -0.1411 0.2709 -0.0825 -0.2261 0.2556 -0.1465 -0.2081 -0.1404 -0.0895 -0.1563 0.0777 0.0830 0.0898 0.0704 0.0884 0.1029 0.0881 0.0811 0.1177 0.0835 0.0901 0.0843 0.1028 0.0839 0.0898 0.1113 0.0996 0.1236 0.1065 0.1235 0.1237 0.1318 0.1235 0.1317 0.1237 0.1223
va: 2.1198 2.1061 2.1186 3.7720 3.7932 3.8783 3.9070 3.9157 3.8362 4.1988 3.7549 3.9282 3.9454 3.8698 3.6880 3.9481 3.9872 3.7940 3.9326 4.0421 3.8430 3.8897 4.0276 3.9567 3.9397 3.9996 1.0113 1.0293 1.0049 1.0076 1.0044 1.0202 1.0036 1.0023 1.0208 1.0127 0.9996 0.9995 1.0044 1.0106 0.9947 0.9913 1.0103 1.0194 1.0170 0.9993 1.0133 1.0104 1.0150 0.9947 0.9986 1.0020
dispcorr: -0.028573011 hartree
energy: -1117.873245385245
dipole: -15.79405 15.67617 -0.11788 -19.01747 18.52094 -0.49654 -5.07962 5.48544 0.40582
magnitude: 0.65202 au
magnitude: 1.65730 debye
