program: Orca
programVersion: 5.0.2
elementType: Cl Cl F F F F O O C C C C C C C C C C C C C C C H H H H H H H H H H H H
charge: 0
multiplicity: 1
keywords: wb97x-d3
keywords: def2-TZVPP
keywords: def2/J RIJCOSX
keywords: DEFGRID2
keywords: scfconv7
keywords: smallprint printgap noloewdin
keywords: NOSOSCF
formula: C15H12Cl2F4O2
InChI: InChI=1/C15H12Cl2F4O2/c1-15(2)7(3-10(16)17)11(15)14(22)23-5-6-12(20)8(18)4-9(19)13(6)21/h3-4,7,11H,5H2,1-2H3
35 atoms
Cl -2.095336 1.87335 1.653233
Cl -4.88961 2.261393 1.05466
F  1.351109 1.865196 -0.472767
F  3.665404 -2.21039 -0.864768
F  5.071151 -1.623822 1.326891
F  2.749652 2.436814 1.743429
O  0.283347 -0.671724 -1.425759
O  -0.479363 -1.053427 -3.48721
C  -2.436051 -2.048376 -0.672811
C  -2.028975 -1.010571 -1.69904
C  -2.313837 -0.607903 -0.264307
C  -1.420975 -3.018244 -0.118468
C  -3.795793 -2.674353 -0.867528
C  -3.478653 0.242548 0.004754
C  -0.681499 -0.923249 -2.300564
C  -3.47933 1.306301 0.798251
C  1.618622 -0.521334 -1.918544
C  2.46074 -0.191857 -0.724726
C  2.261386 0.9950 -0.034138
C  3.425489 -1.058445 -0.239555
C  4.158796 -0.753747 0.893496
C  2.988618 1.294509 1.100379
C  3.948103 0.423873 1.575643
H  -2.801841 -0.778271 -2.423112
H  -1.438261 -0.388004 0.333997
H  -0.455106 -2.562713 0.09064
H  -1.791537 -3.44046 0.817341
H  -1.262791 -3.845559 -0.812109
H  -4.220804 -2.97221 0.092447
H  -4.507256 -2.013024 -1.360376
H  -3.707566 -3.570867 -1.482844
H  -4.412702 0.005154 -0.49063
H  1.661377 0.280546 -2.65701
H  1.954051 -1.437589 -2.40137
H  4.520873 0.66181 2.463034
elementType: Cl F O C H
totalener: -2049.15482762 hartree
nucrepener: 2272.96602949 hartree
electener: -4322.12085711 hartree
oneelecener: -7341.82765856 hartree
twoeener: 3019.70680145 hartree
cpcmener: -0.02618050 hartree
kineticenergy: 2043.53376436 hartree
xcener: -143.163768346501 hartree
chargesum: -0.0000000
charge: -0.060967 -0.062853 -0.204160 -0.203891 -0.203690 -0.203510 -0.268411 -0.489201 0.077782 -0.078619 0.046179 -0.259187 -0.278001 -0.209170 0.430954 0.044491 0.064506 -0.182714 0.229826 0.271681 0.189151 0.198936 -0.157631 0.102482 0.081104 0.091247 0.098144 0.100555 0.102199 0.094232 0.098476 0.130923 0.138224 0.115863 0.155049
qa: -0.0610 -0.0629 -0.2042 -0.2039 -0.2037 -0.2035 -0.2684 -0.4892 0.0778 -0.0786 0.0462 -0.2592 -0.2780 -0.2092 0.4310 0.0445 0.0645 -0.1827 0.2298 0.2717 0.1892 0.1989 -0.1576 0.1025 0.0811 0.0912 0.0981 0.1006 0.1022 0.0942 0.0985 0.1309 0.1382 0.1159 0.1550
va: 1.2664 1.2426 1.0939 1.0972 1.0844 1.0851 2.1277 2.0108 3.7892 3.8454 3.8343 3.9005 3.9092 3.8889 4.1381 4.2099 3.8177 3.7061 3.8918 3.8728 3.9656 3.9648 3.8588 1.0275 1.0333 1.0130 1.0001 1.0008 1.0000 1.0055 1.0009 1.0201 0.9975 1.0158 0.9979
dispcorr: -0.017359912 hartree
energy: -2049.172187527695
dipole: -17.85026 17.97716 0.12691 -24.89566 23.96388 -0.93178 -12.51047 13.14912 0.63865
magnitude: 1.13675 au
magnitude: 2.88938 debye
