program: Orca
programVersion: 5.0.2
elementType: Cl Cl F F F F O O C C C C C C C C C C C C C C C H H H H H H H H H H H H
charge: 0
multiplicity: 1
keywords: wb97x-d3
keywords: def2-TZVPP
keywords: def2/J RIJCOSX
keywords: DEFGRID2
keywords: scfconv7
keywords: smallprint printgap noloewdin
keywords: NOSOSCF
formula: C15H12Cl2F4O2
InChI: InChI=1/C15H12Cl2F4O2/c1-15(2)7(3-10(16)17)11(15)14(22)23-5-6-12(20)8(18)4-9(19)13(6)21/h3-4,7,11H,5H2,1-2H3
35 atoms
Cl -4.683025 -1.520792 1.810588
Cl -5.493303 1.238405 1.586781
F  4.208633 0.480901 -2.33091
F  1.819326 -0.44367 1.609859
F  3.3182 1.34408 2.932839
F  5.697021 2.260121 -1.011965
O  0.82272 -0.475707 -1.282902
O  -0.208011 -2.325628 -0.543957
C  -2.602423 -1.00173 -2.11047
C  -1.48687 -0.431709 -1.254901
C  -2.79564 -0.869254 -0.627151
C  -2.506603 -2.394946 -2.680713
C  -3.274552 -0.028801 -3.048207
C  -3.672644 0.15492 -0.048747
C  -0.257219 -1.198586 -0.976129
C  -4.497522 -0.027789 0.974433
C  2.124964 -1.044194 -1.104481
C  2.977241 -0.039022 -0.392487
C  3.974434 0.67584 -1.033749
C  2.775513 0.216764 0.95541
C  3.54627 1.137089 1.63654
C  4.747799 1.597645 -0.350953
C  4.543856 1.837543 0.989907
H  -1.337561 0.636607 -1.361716
H  -2.746859 -1.806503 -0.085168
H  -2.134684 -3.128633 -1.96971
H  -3.497717 -2.723087 -2.997778
H  -1.858647 -2.411534 -3.558787
H  -3.256227 0.998069 -2.68571
H  -2.774979 -0.040823 -4.018053
H  -4.316076 -0.312032 -3.208706
H  -3.651856 1.146342 -0.485165
H  2.526268 -1.278833 -2.088463
H  2.08057 -1.973786 -0.539066
H  5.149932 2.55866 1.523165
elementType: Cl F O C H
totalener: -2049.15615384 hartree
nucrepener: 2184.23586831 hartree
electener: -4233.39202215 hartree
oneelecener: -7164.79079794 hartree
twoeener: 2931.39877579 hartree
cpcmener: -0.02488033 hartree
kineticenergy: 2043.54035908 hartree
xcener: -143.165392623072 hartree
chargesum: 0.0000000
charge: -0.057738 -0.062652 -0.203116 -0.204285 -0.203385 -0.204004 -0.281147 -0.484766 0.088657 -0.105746 0.033393 -0.270063 -0.263247 -0.201119 0.441483 0.040267 0.065624 -0.152253 0.238555 0.255061 0.195734 0.196127 -0.160584 0.098846 0.076366 0.092812 0.098941 0.102128 0.091968 0.098660 0.100759 0.132210 0.119571 0.130661 0.156282
qa: -0.0577 -0.0627 -0.2031 -0.2043 -0.2034 -0.2040 -0.2811 -0.4848 0.0887 -0.1057 0.0334 -0.2701 -0.2632 -0.2011 0.4415 0.0403 0.0656 -0.1523 0.2386 0.2551 0.1957 0.1961 -0.1606 0.0988 0.0764 0.0928 0.0989 0.1021 0.0920 0.0987 0.1008 0.1322 0.1196 0.1307 0.1563
va: 1.2679 1.2424 1.0982 1.0965 1.0848 1.0841 2.1265 2.0245 3.7339 3.8473 3.8622 3.9077 3.9089 3.8976 4.1572 4.2059 3.7940 3.6446 3.9101 3.8728 3.9768 3.9570 3.8616 1.0338 1.0497 1.0182 1.0000 0.9988 1.0055 1.0013 1.0009 1.0174 1.0083 1.0206 0.9972
dispcorr: -0.016055497 hartree
energy: -2049.172209337985
dipole: -14.61001 15.31185 0.70183 -10.71057 11.60838 0.89781 -25.62721 24.20106 -1.42615
magnitude: 1.82552 au
magnitude: 4.64011 debye
