program: Orca
programVersion: 5.0.2
elementType: Cl Cl F F F F O O C C C C C C C C C C C C C C C H H H H H H H H H H H H
charge: 0
multiplicity: 1
keywords: wb97x-d3
keywords: def2-TZVPP
keywords: def2/J RIJCOSX
keywords: DEFGRID2
keywords: scfconv7
keywords: smallprint printgap noloewdin
keywords: NOSOSCF
formula: C15H12Cl2F4O2
InChI: InChI=1/C15H12Cl2F4O2/c1-15(2)7(3-10(16)17)11(15)14(22)23-5-6-12(20)8(18)4-9(19)13(6)21/h3-4,7,11H,5H2,1-2H3
35 atoms
Cl -3.02629 1.47641 1.967205
Cl -5.676525 1.479772 0.821437
F  2.633357 2.512684 -0.60851
F  2.567522 -2.190273 -0.545923
F  4.259628 -2.185307 1.525142
F  4.336794 2.512975 1.442171
O  0.349255 -0.203705 -1.384821
O  -0.313389 -0.525497 -3.48914
C  -2.09233 -1.976042 -0.703636
C  -1.87057 -0.910019 -1.757533
C  -2.330184 -0.531313 -0.362312
C  -0.929386 -2.675617 -0.041535
C  -3.266563 -2.896771 -0.9353
C  -3.682328 0.018836 -0.206982
C  -0.550415 -0.534095 -2.304417
C  -4.06593 0.871073 0.734857
C  1.663598 0.119103 -1.845532
C  2.565439 0.157094 -0.650782
C  3.025242 1.343585 -0.103014
C  2.994782 -1.023574 -0.06243
C  3.867805 -1.021607 1.007093
C  3.905969 1.345846 0.964495
C  4.336088 0.165675 1.531592
H  -2.633803 -0.884538 -2.527636
H  -1.57194 -0.08968 0.273561
H  -0.469494 -3.396463 -0.720517
H  -0.158709 -1.996236 0.313991
H  -1.29191 -3.230122 0.826131
H  -2.943556 -3.785847 -1.480269
H  -3.685824 -3.227732 0.016824
H  -4.068034 -2.437792 -1.513133
H  -4.436802 -0.280557 -0.925018
H  1.653643 1.077948 -2.363481
H  2.017841 -0.630608 -2.554556
H  5.02395 0.170701 2.367755
elementType: Cl F O C H
totalener: -2049.16733732 hartree
nucrepener: 2237.44955749 hartree
electener: -4286.61689481 hartree
oneelecener: -7270.58229266 hartree
twoeener: 2983.96539785 hartree
cpcmener: -0.02138091 hartree
kineticenergy: 2043.52746570 hartree
xcener: -143.161163745840 hartree
chargesum: 0.0000000
charge: -0.056960 -0.060950 -0.200289 -0.202681 -0.200488 -0.200638 -0.268149 -0.460032 0.093773 -0.090129 0.058585 -0.270768 -0.267025 -0.222634 0.408202 0.045390 0.063836 -0.191327 0.276915 0.249436 0.185155 0.177896 -0.151555 0.094863 0.084161 0.105146 0.084249 0.097835 0.099238 0.099529 0.090087 0.128516 0.121724 0.124379 0.154710
qa: -0.0570 -0.0610 -0.2003 -0.2027 -0.2005 -0.2006 -0.2681 -0.4600 0.0938 -0.0901 0.0586 -0.2708 -0.2670 -0.2226 0.4082 0.0454 0.0638 -0.1913 0.2769 0.2494 0.1852 0.1779 -0.1516 0.0949 0.0842 0.1051 0.0842 0.0978 0.0992 0.0995 0.0901 0.1285 0.1217 0.1244 0.1547
va: 1.2688 1.2441 1.1026 1.0949 1.0902 1.0881 2.1276 2.0463 3.7095 3.8717 3.8236 3.9152 3.9148 3.8930 4.1689 4.2130 3.8140 3.7025 3.8752 3.8521 3.9959 3.9699 3.8567 1.0312 1.0408 0.9992 1.0126 1.0017 1.0005 1.0008 1.0062 1.0197 1.0097 1.0049 0.9980
dispcorr: -0.017293576 hartree
energy: -2049.184630893371
dipole: -12.68394 13.14529 0.46135 -22.08191 21.19646 -0.88545 -13.13812 13.65732 0.51920
magnitude: 1.12536 au
magnitude: 2.86044 debye
