program: Gaussian 09
title: 000068274
version: EM64L-G09RevD.01
frameworkgroup: C1[X(C19H16N4)]
method: RPBEPBE
basis: SDD
operation: Freq
keyword: #pfreq=noraman
keyword: PBEPBE/SDD
title: #p freq=noraman PBEPBE/SDD
converged: YES YES NO NO
title: Mulliken charges:
elementType: N N N N C C C C C C C C C C C C C C C C C C C H H H H H H H H H H H H H H H H
charge: -0.402407 -0.054777 -0.163687 -0.138273 0.274895 -0.019334 0.468115 -0.350733 -0.321060 -0.232050 -0.250232 -0.413195 -0.361992 -0.234920 0.202670 -0.188737 -0.188396 -0.257160 -0.346643 -0.295043 -0.201063 -0.201628 -0.238590 0.258943 0.288234 0.318208 0.223130 0.222977 0.226605 0.271145 0.226691 0.227696 0.228534 0.231364 0.252628 0.245625 0.232313 0.228069 0.232076
chargesum: 0.00000
title: Mulliken charges with hydrogens summed into heavy atoms:
elementType: N N N N C C C C C C C C C C C C C C C C C C C
charge: -0.084199 -0.054777 -0.163687 -0.138273 0.274895 -0.019334 0.468115 -0.091790 -0.032825 -0.008920 -0.027256 -0.186589 -0.090846 -0.008229 0.202670 0.038959 0.040138 -0.025796 -0.094014 -0.049418 0.031250 0.026441 -0.006514
polarizability: 5.23039691e+02 -7.01870406e+00 3.54043965e+02 -3.13280013e+00 -3.36346437e+00 9.28240692e+01
1716.lowfreq: -9.4630 -0.0008 -0.0004 0.0002 0.7521 3.3805 6.4788 20.6169 32.7261
frequency: -5.8318 20.5849 32.7214 38.3706 45.8332 68.6302 92.6886 136.8129 158.4109 191.9802 221.0323 228.8107 259.0558 275.0900 280.6927 300.4834 402.1274 406.6476 407.4160 417.3044 440.5276 464.3293 502.0026 510.9751 533.9290 583.3677 610.3298 612.7725 617.4196 648.5266 649.3946 688.5828 691.0167 691.7805 699.4833 763.9399 773.3273 781.5710 790.0859 826.8839 845.1690 853.7901 858.1674 860.0921 882.5290 908.3621 932.2933 939.6102 970.5907 980.2649 982.9263 984.9337 986.9968 989.5471 991.9128 996.7937 999.9967 1014.4751 1018.5597 1022.6206 1061.8681 1077.4787 1082.8436 1085.7663 1138.9631 1170.4008 1170.5059 1171.4142 1176.1502 1178.1425 1190.2197 1212.0799 1266.4753 1271.6987 1302.0483 1316.0164 1326.8858 1342.1054 1376.4327 1386.6662 1390.1460 1419.0920 1435.0413 1442.0717 1449.2472 1463.2386 1478.0965 1483.5383 1500.3772 1577.6657 1580.2481 1593.0033 1599.5221 1609.5789 1610.0479 3121.3730 3122.9973 3128.5430 3134.9383 3135.1974 3139.1308 3147.1882 3153.3127 3153.9647 3163.8889 3166.6042 3168.8187 3171.7967 3182.8176 3189.7047 3323.4774
redmass: 3.7941 3.7754 3.9824 5.4134 5.2016 5.2487 5.7273 4.9131 5.3508 5.4163 5.6266 5.8490 7.3932 5.7995 5.2316 4.6312 2.8761 2.8945 2.9024 6.4910 6.7908 3.7449 3.2150 3.1271 6.6020 7.1838 6.5286 6.5047 6.4174 6.4023 5.1085 5.7574 1.7941 1.9614 1.7934 1.7298 1.9640 2.2556 3.6485 1.2692 1.2615 2.1765 1.2525 2.1535 3.9077 1.4547 1.4579 1.4326 1.3639 1.5985 5.9435 3.7070 2.5258 1.9422 1.3416 1.3304 1.3332 2.1056 2.2330 2.8723 2.5017 1.6382 1.6204 1.6187 2.1238 1.0626 1.0855 1.0594 1.3213 1.3601 1.1460 2.9286 2.9936 2.5132 1.4664 1.4767 1.4546 4.4739 6.8683 7.4703 8.0745 3.7748 2.3052 2.3810 2.9121 2.2299 2.2314 2.5592 2.7233 6.0619 6.1146 6.1339 6.2186 6.1288 6.0359 1.0876 1.0849 1.0852 1.0900 1.0872 1.0885 1.0934 1.0926 1.0958 1.0952 1.0983 1.0967 1.1007 1.0963 1.0947 1.0738
irintensity: 0.2831 0.0850 0.0467 0.0741 0.9189 0.5301 0.3801 0.8286 0.4394 9.3177 0.2280 0.8582 0.9190 0.3881 5.3548 6.5306 0.6624 0.0166 0.6049 3.0012 1.1940 1.2691 31.0412 2.2300 36.6594 26.2098 4.0409 0.2558 0.0118 6.7407 18.1696 17.1120 41.1513 30.3841 52.6870 78.7389 84.4803 11.6556 12.7013 21.3026 1.8944 23.9466 2.2437 26.8129 20.8379 13.5748 7.0611 7.5964 0.0328 0.6339 0.6056 0.0016 5.2900 0.5102 1.2037 0.3262 1.3276 7.5548 0.4349 46.8504 91.3728 13.2920 1.2074 13.9686 1.3264 0.3181 0.2393 0.0554 3.2526 2.1250 22.3452 15.7736 529.8509 10.6929 15.3442 40.7968 1.1989 114.7872 2.0201 2.6977 8.2337 43.9575 33.4675 12.3483 39.8671 22.2301 12.7173 86.5948 435.3577 0.2225 3.9890 4.3222 0.3425 64.3066 11.9699 9.9819 0.4005 3.4364 18.5932 2.9577 7.6650 23.8877 19.9335 38.2699 21.2756 42.2447 17.6541 33.9475 7.7034 12.3677 5.2093
temp: 298.150 k
press: 1.00000 atm
elementType: 7 7 7 7 6 6 6 6 6 6 6 6 6 6 6 6 6 6 6 6 6 6 6 1 1 1 1 1 1 1 1 1 1 1 1 1 1 1 1
symmnumber: 1
zpe: 798049.2 jmol-1
zpe.correction: 0.303961 hartree
zpe.thermalcorrener: 0.321983 hartree
zpe.thermalcorrenthalpy: 0.322927 hartree
zpe.thermalcorrgfe: 0.255459 hartree
zpe.sumelectzpe: -950.983879 hartree
zpe.sumelectthermal: -950.965857 hartree
zpe.sumelectthermalent: -950.964913 hartree
zpe.sumelectthermalfe: -951.032381 hartree
dipole: -0.0861 -2.6798 0.0228
dipole: 2.6813
quadrupole: -109.6596 -113.0892 -142.8366
quadrupole: -2.2776 -0.3831 -0.9441
quadrupole: 12.2022 8.7726 -20.9748 -2.2776 -0.3831 -0.9441
hfenergy: -951.2878399 hartree
pointgroup: C01 [X(C19H16N4)]
dipole: 0.2514458 -1.0077961 -0.1841532 debye
polarizability: 502.6360286|49.4731728|360.5775307|-57.942523|31.7969756|106.6941666 unknown
InChI: InChI=1S/C19H16N4/c1-4-10-16(11-5-1)19(22-20-17-12-6-2-7-13-17)23-21-18-14-8-3-9-15-18/h1-15,20H
charge 0 multiplicity 1
39 atoms
N  1.774751 -0.252583 -0.212144
N  1.137157 0.918194 -0.025838
N  -0.780294 -0.394162 0.080779
N  -2.060834 -0.554766 0.34865
C  -0.869067 2.192026 0.431971
C  -0.210261 0.882846 0.169795
C  3.160426 -0.317245 -0.45873
C  -0.051306 3.332841 0.691555
C  -2.28287 2.365196 0.417842
C  -0.624371 4.59736 0.922683
C  -2.850172 3.638364 0.646914
C  3.755447 -1.599144 -0.609583
C  3.956226 0.855521 -0.553873
C  -2.030863 4.760101 0.900435
C  -2.542581 -1.888799 0.175716
C  5.140093 -1.703513 -0.851645
C  5.338646 0.732885 -0.794288
C  5.940886 -0.540584 -0.944817
C  -3.849075 -2.124795 0.686594
C  -1.841057 -2.943575 -0.478902
C  -4.438389 -3.399667 0.568591
C  -2.44048 -4.210925 -0.600348
C  -3.736743 -4.447419 -0.07456
H  1.03489 3.206147 0.707533
H  -2.922477 1.499405 0.241827
H  1.192179 -1.108934 -0.197148
H  0.024284 5.45768 1.123538
H  -3.940419 3.749774 0.629653
H  3.137756 -2.502688 -0.53367
H  3.478858 1.832055 -0.441015
H  -2.477401 5.744346 1.081482
H  5.594111 -2.693845 -0.966549
H  5.951965 1.6379 -0.867526
H  7.016243 -0.62477 -1.132973
H  -4.370273 -1.2955 1.176215
H  -0.849034 -2.744548 -0.89565
H  -5.441558 -3.577136 0.970905
H  -1.906295 -5.019818 -1.111758
H  -4.196701 -5.436723 -0.174861
