program: Orca
programVersion: 5.0.2
elementType: Cl Cl F F F F O O C C C C C C C C C C C C C C C H H H H H H H H H H H H
charge: 0
multiplicity: 1
keywords: wb97x-d3
keywords: def2-TZVPP
keywords: def2/J RIJCOSX
keywords: DEFGRID2
keywords: scfconv7
keywords: smallprint printgap noloewdin
keywords: NOSOSCF
formula: C15H12Cl2F4O2
InChI: InChI=1/C15H12Cl2F4O2/c1-15(2)7(3-10(16)17)11(15)14(22)23-5-6-12(20)8(18)4-9(19)13(6)21/h3-4,7,11H,5H2,1-2H3
35 atoms
Cl -2.971431 -2.628668 0.943768
Cl -4.67546 -0.898058 2.499596
F  4.086814 1.395382 -1.812867
F  1.14213 -1.221384 0.766651
F  2.558798 -0.64881 2.955041
F  5.534601 1.9032 0.373576
O  0.359888 -0.081266 -1.600731
O  0.598475 2.128731 -1.421289
C  -2.636055 0.718033 -2.016157
C  -1.548999 1.195642 -1.076853
C  -2.359948 -0.042147 -0.747448
C  -2.285515 0.050738 -3.323449
C  -3.858169 1.598545 -2.115505
C  -3.273814 -0.001983 0.400534
C  -0.103394 1.147149 -1.385871
C  -3.589709 -1.037279 1.168523
C  1.75726 -0.236451 -1.819879
C  2.56226 0.08045 -0.58928
C  3.693446 0.878629 -0.64777
C  2.210896 -0.432958 0.650903
C  2.948199 -0.145488 1.783763
C  4.443994 1.145042 0.482814
C  4.076762 0.643016 1.712422
H  -1.803538 2.094678 -0.526024
H  -1.847112 -0.984465 -0.896079
H  -1.978801 0.789951 -4.066329
H  -1.491776 -0.688294 -3.234442
H  -3.163555 -0.4646 -3.717705
H  -4.739714 1.003488 -2.361819
H  -4.069754 2.143404 -1.196113
H  -3.726815 2.338833 -2.906784
H  -3.72938 0.947436 0.655936
H  2.082385 0.363647 -2.669144
H  1.884579 -1.283751 -2.092192
H  4.661786 0.85865 2.597427
elementType: Cl F O C H
totalener: -2049.16567982 hartree
nucrepener: 2273.19025830 hartree
electener: -4322.35593812 hartree
oneelecener: -7342.95100188 hartree
twoeener: 3020.59506376 hartree
cpcmener: -0.02247780 hartree
kineticenergy: 2043.53753269 hartree
xcener: -143.164878880834 hartree
chargesum: 0.0000000
charge: -0.057520 -0.061170 -0.202771 -0.200342 -0.202129 -0.202250 -0.274436 -0.449122 0.075627 -0.090242 0.058793 -0.262778 -0.269243 -0.220317 0.407780 0.046406 0.049360 -0.113836 0.240364 0.213997 0.188367 0.196580 -0.172271 0.098124 0.079957 0.101285 0.093551 0.096617 0.100212 0.089992 0.099136 0.129291 0.126792 0.132590 0.153608
qa: -0.0575 -0.0612 -0.2028 -0.2003 -0.2021 -0.2023 -0.2744 -0.4491 0.0756 -0.0902 0.0588 -0.2628 -0.2692 -0.2203 0.4078 0.0464 0.0494 -0.1138 0.2404 0.2140 0.1884 0.1966 -0.1723 0.0981 0.0800 0.1013 0.0936 0.0966 0.1002 0.0900 0.0991 0.1293 0.1268 0.1326 0.1536
va: 1.2678 1.2439 1.0958 1.0966 1.0877 1.0864 2.1157 2.0638 3.7632 3.8382 3.8032 3.9057 3.9113 3.8960 4.1734 4.2121 3.8568 3.5695 3.9072 3.9212 3.9725 3.9597 3.8671 1.0291 1.0471 0.9998 1.0138 1.0005 1.0011 1.0060 1.0009 1.0191 1.0144 0.9949 0.9988
dispcorr: -0.017576050 hartree
energy: -2049.183255870839
dipole: -18.92863 18.61450 -0.31413 10.00279 -10.29063 -0.28784 -26.01353 25.08234 -0.93119
magnitude: 1.02404 au
magnitude: 2.60290 debye
