program: Orca
programVersion: 5.0.2
elementType: Cl Cl F F F F O O C C C C C C C C C C C C C C C H H H H H H H H H H H H
charge: 0
multiplicity: 1
keywords: wb97x-d3
keywords: def2-TZVPP
keywords: def2/J RIJCOSX
keywords: DEFGRID2
keywords: scfconv7
keywords: smallprint printgap noloewdin
keywords: NOSOSCF
formula: C15H12Cl2F4O2
InChI: InChI=1/C15H12Cl2F4O2/c1-15(2)7(3-10(16)17)11(15)14(22)23-5-6-12(20)8(18)4-9(19)13(6)21/h3-4,7,11H,5H2,1-2H3
35 atoms
Cl -3.204354 0.588534 2.216065
Cl -5.653404 1.441794 0.946666
F  2.601478 2.491364 -0.643181
F  2.518079 -2.209232 -0.631687
F  4.087139 -2.228455 1.545173
F  4.173741 2.465639 1.521639
O  0.343852 -0.121613 -1.53965
O  -0.255316 -0.185345 -3.688871
C  -2.265828 -1.79467 -1.191022
C  -1.91172 -0.602728 -2.055786
C  -2.379136 -0.40169 -0.633747
C  -1.194697 -2.698395 -0.63134
C  -3.520959 -2.542309 -1.574087
C  -3.684468 0.236982 -0.403732
C  -0.543306 -0.287443 -2.527868
C  -4.116812 0.693978 0.764819
C  1.687718 0.12877 -1.943643
C  2.533772 0.138943 -0.707428
C  2.959271 1.321296 -0.121521
C  2.920033 -1.052515 -0.10972
C  3.724895 -1.065171 1.013584
C  3.769077 1.31154 1.001528
C  4.156348 0.119371 1.577337
H  -2.63811 -0.389732 -2.832823
H  -1.60751 -0.138581 0.080413
H  -0.859657 -3.415968 -1.382561
H  -0.323077 -2.159994 -0.270164
H  -1.599708 -3.265594 0.208245
H  -4.276229 -1.904146 -2.031048
H  -3.287244 -3.332825 -2.288655
H  -3.971497 -3.007654 -0.696198
H  -4.354512 0.353344 -1.246931
H  1.754427 1.080388 -2.471164
H  2.029438 -0.645034 -2.633382
H  4.787404 0.112673 2.455657
totalener: -2049.15032116 hartree
nucrepener: 2235.22901291 hartree
electener: -4284.37933407 hartree
oneelecener: -7266.28474756 hartree
twoeener: 2981.90541349 hartree
kineticenergy: 2043.57426730 hartree
xcener: -143.165112121553 hartree
chargesum: 0.0000000
charge: -0.043154 -0.043005 -0.183383 -0.186089 -0.180546 -0.179724 -0.268000 -0.352267 0.079400 -0.108972 0.068438 -0.246737 -0.233058 -0.216135 0.331824 0.044938 0.057762 -0.203711 0.272836 0.245712 0.172825 0.163734 -0.154979 0.081705 0.085131 0.096024 0.078901 0.090018 0.071911 0.096130 0.095696 0.102648 0.114593 0.115977 0.133557
qa: -0.0432 -0.0430 -0.1834 -0.1861 -0.1805 -0.1797 -0.2680 -0.3523 0.0794 -0.1090 0.0684 -0.2467 -0.2331 -0.2161 0.3318 0.0449 0.0578 -0.2037 0.2728 0.2457 0.1728 0.1637 -0.1550 0.0817 0.0851 0.0960 0.0789 0.0900 0.0719 0.0961 0.0957 0.1026 0.1146 0.1160 0.1336
va: 1.2846 1.2636 1.1238 1.1169 1.1163 1.1159 2.1090 2.1529 3.7411 3.9086 3.7629 3.9238 3.9103 3.9013 4.2671 4.2368 3.8339 3.7111 3.8745 3.8595 4.0191 4.0051 3.8578 1.0351 1.0414 1.0021 1.0189 1.0038 1.0095 1.0038 1.0040 1.0249 1.0113 1.0053 1.0070
dispcorr: -0.017254868 hartree
energy: -2049.167576025879
dipole: -13.34316 13.61936 0.27620 -18.65437 18.08970 -0.56466 -17.73609 18.01339 0.27730
magnitude: 0.68704 au
magnitude: 1.74632 debye
