program: Gaussian 09
title: 000068143
version: EM64L-G09RevD.01
frameworkgroup: C1[X(C8H5F3O2)]
method: RPBEPBE
basis: SDD
operation: Freq
keyword: #pfreq=noraman
keyword: PBEPBE/SDD
title: #p freq=noraman PBEPBE/SDD
converged: NO YES NO NO
title: Mulliken charges:
elementType: F F F O O C C C C C C C C H H H H H
charge: -0.132650 -0.147571 -0.147499 -0.278915 -0.143252 0.425883 -0.344007 -0.343944 -0.193626 -0.193650 -0.231895 0.158776 0.348113 0.254880 0.254872 0.238262 0.238263 0.237959
chargesum: 0.00000
title: Mulliken charges with hydrogens summed into heavy atoms:
elementType: F F F O O C C C C C C C C
charge: -0.132650 -0.147571 -0.147499 -0.278915 -0.143252 0.425883 -0.089128 -0.089072 0.044636 0.044613 0.006064 0.158776 0.348113
polarizability: 1.19881332e+02 -1.91120563e-03 8.81818571e+01 1.32842347e+00 -1.39446122e-02 5.70014663e+01
1716.lowfreq: -46.1626 -18.6343 -12.2043 -5.1912 -4.4364 -0.0012 -0.0011 -0.0010 49.4409
frequency: -45.9920 -18.5693 49.2133 74.7498 182.9150 231.5122 242.4148 281.9338 374.0494 396.3223 407.6387 453.9350 472.5710 497.6847 564.0444 608.9323 648.2469 688.3804 695.3050 735.1071 781.1872 806.8389 833.9033 918.7177 970.9735 987.1893 996.3449 1016.8853 1017.9584 1035.9577 1063.6988 1075.9813 1147.9559 1174.3586 1178.1265 1224.1852 1307.0488 1384.7677 1442.5044 1468.9147 1595.9955 1610.3695 1679.2638 3140.0290 3149.9664 3162.1452 3171.2300 3179.9131
redmass: 7.6927 7.6937 7.1023 7.5618 10.1016 13.8905 5.5857 13.3113 16.4885 7.2540 2.8822 14.9182 5.8213 5.4484 10.3295 6.5597 11.3479 2.3230 12.9944 2.1353 5.4907 3.7971 1.2472 1.4544 1.3775 6.3321 1.3255 13.0832 2.3897 7.5873 12.7062 1.5029 2.9472 1.0554 1.2415 12.3961 1.3114 10.1727 2.2154 2.2345 6.2171 7.0422 12.9200 1.0856 1.0893 1.0933 1.0972 1.1016
irintensity: 0.1349 0.0000 0.0007 0.5177 2.8255 2.5974 2.3118 2.1524 2.0805 0.7702 0.0257 8.2686 10.9193 13.2637 8.9317 0.0845 15.2970 27.8171 11.4601 47.4421 17.4375 49.8734 0.0135 8.3215 0.0787 28.7223 0.3138 225.2058 0.7134 430.9089 158.5920 12.6896 151.4595 0.0404 18.4004 105.8413 0.2635 2.0729 4.5229 60.7844 29.2229 7.4128 207.4869 0.0274 7.1557 16.8922 9.1707 5.3171
temp: 298.150 k
press: 1.00000 atm
elementType: 9 9 9 8 8 6 6 6 6 6 6 6 6 1 1 1 1 1
symmnumber: 1
zpe: 299828.2 jmol-1
zpe.correction: 0.114199 hartree
zpe.thermalcorrener: 0.123844 hartree
zpe.thermalcorrenthalpy: 0.124788 hartree
zpe.thermalcorrgfe: 0.078008 hartree
zpe.sumelectzpe: -756.864693 hartree
zpe.sumelectthermal: -756.855047 hartree
zpe.sumelectthermalent: -756.854103 hartree
zpe.sumelectthermalfe: -756.900883 hartree
dipole: 4.3269 -0.0020 -0.8185
dipole: 4.4036
quadrupole: -66.9173 -64.8525 -81.7346
quadrupole: 0.0032 1.5763 -0.0165
quadrupole: 4.2508 6.3156 -10.5664 0.0032 1.5763 -0.0165
hfenergy: -756.9788911 hartree
pointgroup: C01 [X(C8H5F3O2)]
dipole: -1.7062138 0.0000711 -0.300677 debye
dipolederiv: -0.4306163 -0.0000413 0.1252829 -0.0000014 -0.2639603 0.0006162 0.0732997 0.0006148 -0.8258235 -0.5720369 0.2322248 -0.0625918 0.2075232 -0.6158979 0.1476774 -0.0379043 0.129619 -0.3337173 -0.5728503 -0.2324735 -0.0635963 -0.2077609 -0.614394 -0.1482167 -0.0387696 -0.130179 -0.3342959 -1.7061659 -0.000357 -0.3857929 -0.000428 -0.2376577 -0.0004312 -0.3784273 -0.0002687 -0.6224216 -0.5478277 0.0001719 0.1280296 -0.0002554 -0.228909 -0.0004148 -0.4174222 -0.0006878 -0.8402471 1.200454 0.0001089 0.0953311 -0.0000792 0.2451933 -0.0002755 -0.1933558 -0.0003289 0.0043391 -0.2237278 0.0649869 -0.0504005 0.0696931 -0.0311072 -0.021016 0.0144565 0.0000009 -0.1114143 -0.2236747 -0.0651461 -0.0501557 -0.069759 -0.03112 0.0207288 0.014643 -0.0003376 -0.1114803 0.0185298 -0.0769694 -0.0309287 -0.0516136 0.099 0.0186234 -0.0272566 0.0123272 -0.1275097 0.0184822 0.0768399 -0.0311769 0.0514813 0.0989843 -0.0193618 -0.0273963 -0.0130728 -0.1273806 0.1021775 -0.0000261 -0.0488437 -0.0000236 -0.0916873 -0.0001085 -0.0437178 -0.000098 -0.1464219 1.3816561 0.0001408 0.2323696 0.0005181 0.1222435 0.0011448 0.9401962 0.0012403 1.3262988 1.4786926 0.0003159 0.0255447 0.000493 1.534723 -0.0002263 0.0011231 -0.0001318 1.4558838 0.0608113 -0.0755877 0.0271204 -0.0772303 0.0098385 0.0076965 0.0193545 0.0068839 0.1596117 0.0607152 0.0756969 0.0268777 0.0773168 0.0098608 -0.0072192 0.0191049 -0.0063694 0.1596357 0.0283607 0.0741054 0.0115966 0.0821255 -0.0483244 -0.0092484 0.0191032 -0.0105114 0.1580374 0.0284327 -0.0740138 0.0118271 -0.0820254 -0.0483186 0.0099149 0.0193794 0.0111801 0.1579741 -0.1014125 0.0000237 0.0395068 0.0000257 0.0915329 0.0001164 0.0435893 0.0001192 0.1589316 unknown
polarizability: 119.8382274|-0.0064844|88.1817528|-2.1150007|-0.0586875|57.0446754 unknown
InChI: InChI=1S/C8H5F3O2/c9-8(10,11)7(12)13-6-4-2-1-3-5-6/h1-5H
charge 0 multiplicity 1
18 atoms
F  2.783931 0.001484 -1.53236
F  3.394339 -1.139005 0.328492
F  3.396771 1.136101 0.331233
O  0.349629 -0.000278 -0.606281
O  1.021881 0.001558 1.651239
C  -1.064779 -0.000161 -0.289999
C  -1.727727 1.234801 -0.184152
C  -1.72717 -1.235079 -0.180187
C  -3.122123 1.22564 0.046712
C  -3.121567 -1.225808 0.050655
C  -3.818071 -0.000054 0.165227
C  1.257596 0.000707 0.436359
C  2.703685 -0.000116 -0.135163
H  -1.170778 2.171311 -0.284282
H  -1.169797 -2.171658 -0.277282
H  -3.660168 2.17527 0.133156
H  -3.659179 -2.1754 0.140154
H  -4.898271 -0.000012 0.343877
