program: Orca
programVersion: 5.0.2
elementType: Cl Cl F F F F O O C C C C C C C C C C C C C C C H H H H H H H H H H H H
charge: 0
multiplicity: 1
keywords: wb97x-d3
keywords: def2-TZVPP
keywords: def2/J RIJCOSX
keywords: DEFGRID2
keywords: scfconv7
keywords: smallprint printgap noloewdin
keywords: NOSOSCF
formula: C15H12Cl2F4O2
InChI: InChI=1/C15H12Cl2F4O2/c1-15(2)7(3-10(16)17)11(15)14(22)23-5-6-12(20)8(18)4-9(19)13(6)21/h3-4,7,11H,5H2,1-2H3
35 atoms
Cl -1.850677 -1.066444 1.791359
Cl -4.564968 -0.528355 2.612143
F  3.689007 1.144696 -2.144744
F  1.522443 -0.949763 1.46189
F  2.922633 0.574212 3.177397
F  5.08651 2.653771 -0.429382
O  0.429965 -0.291219 -1.27173
O  -0.341428 -2.218204 -2.102274
C  -3.053195 -0.672405 -2.350909
C  -1.868708 -0.504065 -1.417625
C  -3.020162 -1.4143 -1.056585
C  -2.928336 -1.445549 -3.640604
C  -3.950083 0.537845 -2.462932
C  -3.908816 -1.067532 0.073967
C  -0.546623 -1.121208 -1.655414
C  -3.493723 -0.908119 1.323943
C  1.761804 -0.792573 -1.318193
C  2.572448 0.053711 -0.384514
C  3.488433 0.988695 -0.838482
C  2.393339 -0.062989 0.987034
C  3.11466 0.716975 1.870324
C  4.213402 1.770271 0.04538
C  4.030549 1.640638 1.405662
H  -1.828782 0.445234 -0.896613
H  -2.788384 -2.47355 -1.140803
H  -3.918911 -1.752887 -3.980325
H  -2.491127 -0.823121 -4.423258
H  -2.316155 -2.337724 -3.542295
H  -3.57732 1.220131 -3.22808
H  -4.961105 0.242516 -2.750459
H  -4.020801 1.09647 -1.529151
H  -4.970835 -0.964313 -0.116728
H  2.1480 -0.742911 -2.336433
H  1.79222 -1.839317 -1.011465
H  4.594368 2.250547 2.098212
totalener: -2049.15049735 hartree
nucrepener: 2269.53329351 hartree
electener: -4318.68379086 hartree
oneelecener: -7335.47659020 hartree
twoeener: 3016.79279934 hartree
kineticenergy: 2043.58798513 hartree
xcener: -143.168100139113 hartree
chargesum: 0.0000000
charge: -0.031944 -0.043505 -0.186793 -0.186491 -0.180859 -0.181876 -0.256328 -0.385441 0.123265 -0.148072 -0.019313 -0.250805 -0.266305 -0.249324 0.357228 0.098844 0.054414 -0.186189 0.262596 0.240801 0.183328 0.171990 -0.163164 0.105377 0.107870 0.083620 0.086512 0.105008 0.095480 0.092256 0.087029 0.117692 0.111473 0.119341 0.132284
qa: -0.0319 -0.0435 -0.1868 -0.1865 -0.1809 -0.1819 -0.2563 -0.3854 0.1233 -0.1481 -0.0193 -0.2508 -0.2663 -0.2493 0.3572 0.0988 0.0544 -0.1862 0.2626 0.2408 0.1833 0.1720 -0.1632 0.1054 0.1079 0.0836 0.0865 0.1050 0.0955 0.0923 0.0870 0.1177 0.1115 0.1193 0.1323
va: 1.3135 1.2620 1.1179 1.1166 1.1145 1.1133 2.1221 2.1121 3.7156 3.9070 3.8445 3.9010 3.9153 3.9071 4.1745 4.2020 3.8441 3.6883 3.8774 3.8911 4.0024 4.0007 3.8646 1.0237 1.0265 1.0024 1.0021 1.0215 1.0064 1.0019 1.0006 1.0179 1.0098 1.0082 1.0075
dispcorr: -0.017525684 hartree
energy: -2049.168023037266
dipole: -24.43971 24.19072 -0.24899 -5.54116 6.02275 0.48159 -29.38663 28.99125 -0.39538
magnitude: 0.67101 au
magnitude: 1.70556 debye
