program: Orca
programVersion: 5.0.2
elementType: Cl Cl F F F F O O C C C C C C C C C C C C C C C H H H H H H H H H H H H
charge: 0
multiplicity: 1
keywords: wb97x-d3
keywords: def2-TZVPP
keywords: def2/J RIJCOSX
keywords: DEFGRID2
keywords: scfconv7
keywords: smallprint printgap noloewdin
keywords: NOSOSCF
formula: C15H12Cl2F4O2
InChI: InChI=1/C15H12Cl2F4O2/c1-15(2)7(3-10(16)17)11(15)14(22)23-5-6-12(20)8(18)4-9(19)13(6)21/h3-4,7,11H,5H2,1-2H3
35 atoms
Cl -3.441143 -1.049892 2.393657
Cl -4.873768 1.372142 1.759421
F  4.381082 0.152852 -2.107388
F  1.450196 -0.203553 1.544933
F  2.656532 1.903671 2.713614
F  5.584599 2.245635 -0.935364
O  0.861378 -0.708667 -1.332199
O  -0.149882 -2.612231 -0.716122
C  -2.637232 -1.358423 -2.132332
C  -1.448482 -0.734617 -1.433104
C  -2.712151 -1.090467 -0.661467
C  -2.606406 -2.796416 -2.591105
C  -3.371038 -0.456813 -3.097982
C  -3.532378 -0.01503 -0.089526
C  -0.211589 -1.482507 -1.1170
C  -3.89537 0.07968 1.184274
C  2.142962 -1.205977 -0.957849
C  2.881064 -0.073054 -0.30884
C  3.944538 0.569513 -0.920672
C  2.464096 0.397172 0.928726
C  3.085323 1.473831 1.531522
C  4.571016 1.647015 -0.316684
C  4.144666 2.106787 0.911161
H  -1.29263 0.317976 -1.638928
H  -2.600694 -1.969304 -0.036529
H  -3.626919 -3.147119 -2.752599
H  -2.073136 -2.887394 -3.538795
H  -2.133357 -3.462081 -1.875045
H  -3.304731 0.599532 -2.838549
H  -2.954761 -0.564337 -4.100321
H  -4.428007 -0.723704 -3.147498
H  -3.876136 0.775701 -0.744507
H  2.662714 -1.556056 -1.849186
H  2.049186 -2.052199 -0.276573
H  4.631972 2.949703 1.381854
totalener: -2049.15142497 hartree
nucrepener: 2217.77095684 hartree
electener: -4266.92238181 hartree
oneelecener: -7231.84609491 hartree
twoeener: 2964.92371310 hartree
kineticenergy: 2043.57685679 hartree
xcener: -143.167251617077 hartree
chargesum: -0.0000000
charge: -0.036080 -0.047101 -0.187261 -0.180822 -0.180115 -0.182030 -0.268516 -0.381223 0.084796 -0.082126 0.008804 -0.247659 -0.265473 -0.184430 0.364533 0.042742 0.041259 -0.164018 0.239480 0.236871 0.187316 0.183540 -0.169083 0.080390 0.090849 0.087704 0.085149 0.104836 0.074747 0.093673 0.102857 0.098725 0.105234 0.130473 0.131957
qa: -0.0361 -0.0471 -0.1873 -0.1808 -0.1801 -0.1820 -0.2685 -0.3812 0.0848 -0.0821 0.0088 -0.2477 -0.2655 -0.1844 0.3645 0.0427 0.0413 -0.1640 0.2395 0.2369 0.1873 0.1835 -0.1691 0.0804 0.0908 0.0877 0.0851 0.1048 0.0747 0.0937 0.1029 0.0987 0.1052 0.1305 0.1320
va: 1.2924 1.2584 1.1166 1.1260 1.1155 1.1130 2.1161 2.1218 3.7769 3.8492 3.8492 3.9093 3.9143 3.9016 4.2083 4.2674 3.8535 3.6604 3.8936 3.8851 4.0101 3.9900 3.8674 1.0344 1.0470 1.0011 1.0023 1.0223 1.0081 1.0049 1.0008 1.0317 1.0083 1.0151 1.0076
dispcorr: -0.016184602 hartree
energy: -2049.167609573529
dipole: -17.77600 17.93713 0.16112 -15.12931 15.49571 0.36640 -26.91640 26.02545 -0.89095
magnitude: 0.97673 au
magnitude: 2.48264 debye
