program: Gaussian 09
title: 000068139
version: EM64L-G09RevD.01
frameworkgroup: C1[X(C6H4O5)]
method: RPBEPBE
basis: SDD
operation: Freq
keyword: #p
keyword: freq=noraman
keyword: PBEPBE/SDD
title: #p freq=noraman PBEPBE/SDD
converged: NO NO NO NO
title: Mulliken charges:
elementType: O O O O O C C C C C C H H H H
charge: -0.187949 -0.374127 -0.207563 -0.397114 -0.218311 0.190932 -0.348716 0.163960 0.187735 -0.282454 0.152747 0.300557 0.262491 0.363155 0.394656
chargesum: 0.00000
title: Mulliken charges with hydrogens summed into heavy atoms:
elementType: O O O O O C C C C C C
charge: -0.187949 -0.010972 -0.207563 -0.002458 -0.218311 0.190932 -0.048159 0.163960 0.187735 -0.019963 0.152747
polarizability: 1.24469143e+02 5.11949045e+00 9.62250254e+01 -2.02482038e-04 -1.01435810e-02 3.31884408e+01
1716.lowfreq: -11.4459 0.0011 0.0013 0.0015 6.4359 11.1617 54.2164 91.5912 154.5373
frequency: 54.1828 91.5897 154.5368 165.4447 297.3828 312.6760 326.9869 380.5825 394.1891 410.6516 491.0248 497.6963 570.5155 574.8579 625.2448 696.8425 720.8795 730.6151 746.1208 800.8755 872.4639 914.3799 1007.8369 1078.1358 1110.4076 1143.9932 1208.0424 1256.6872 1309.5826 1358.2410 1408.6180 1558.4751 1569.7265 1615.6372 1637.1318 3183.6623 3185.4753 3519.8239 3553.7021
redmass: 10.3437 8.1273 6.2354 8.3121 7.7948 3.9741 9.6776 1.2533 8.8442 3.4010 10.3351 3.9080 5.8068 5.5908 1.3818 6.0756 6.0937 5.2070 6.7680 1.4007 4.6025 1.4542 4.7865 2.3324 2.3829 3.9194 1.6867 1.6487 2.0085 3.4782 2.9135 9.2092 8.9805 7.7631 9.5598 1.0940 1.0934 1.0644 1.0663
irintensity: 0.0509 1.6767 1.6999 0.1358 4.9913 0.1805 2.8382 151.5482 8.6722 13.5025 1.1143 14.4424 37.6075 51.1751 142.9898 10.8620 11.0452 11.1355 15.9485 37.3576 56.2809 31.4618 100.3439 242.6430 226.5078 99.0237 2.8181 47.7712 33.0976 57.0862 9.7441 176.9852 69.4490 159.5366 162.5238 3.0622 9.1653 59.5797 52.5456
temp: 298.150 k
press: 1.00000 atm
elementType: 8 8 8 8 8 6 6 6 6 6 6 1 1 1 1
symmnumber: 1
zpe: 248434.0 jmol-1
zpe.correction: 0.094624 hartree
zpe.thermalcorrener: 0.104180 hartree
zpe.thermalcorrenthalpy: 0.105124 hartree
zpe.thermalcorrgfe: 0.059289 hartree
zpe.sumelectzpe: -606.316005 hartree
zpe.sumelectthermal: -606.306449 hartree
zpe.sumelectthermalent: -606.305504 hartree
zpe.sumelectthermalfe: -606.351339 hartree
dipole: -1.5781 -5.6599 0.0009
dipole: 5.8758
quadrupole: -60.1418 -63.6669 -62.1177
quadrupole: -11.2629 0.0018 0.0008
quadrupole: 1.8337 -1.6914 -0.1422 -11.2629 0.0018 0.0008
hfenergy: -606.4106285 hartree
pointgroup: C01 [X(C6H4O5)]
dipole: 0.5951461 2.2337773 0.0003428 debye
dipolederiv: -0.7015504 -0.0926812 -0.0000251 0.1037956 -0.683289 -0.0000924 -0.0000184 -0.0000795 -0.0887605 -1.3282234 0.3102578 0.000049 0.3511575 -0.0593557 0.0000412 0.0000734 0.0000436 -0.3957198 -0.6493163 -0.3416593 -0.0000716 -0.3279728 -0.791497 -0.000092 -0.0000541 -0.0000599 -0.3423866 -0.730106 -0.5085783 -0.0000923 -0.5807346 -0.8955649 -0.0000798 -0.0000549 -0.0000068 -0.4087859 -0.887583 0.2192859 0.0000294 0.1807813 -0.7979312 -0.000044 0.00008 -0.0001443 -0.3134174 -0.3552828 -0.0161765 0.0000146 -0.2037951 0.6772303 0.0000875 -0.0000519 0.0000809 0.0860376 -0.3114676 -0.3818103 -0.0000608 0.1445359 -0.0988139 0.0000019 0.0000049 0.0000017 -0.1248559 0.7949106 0.4410256 0.0000916 0.4257203 0.9266566 0.000136 0.0001 0.0001182 0.2092574 1.2595694 -0.2630881 -0.0000497 -0.2496506 -0.4655945 -0.0000879 -0.0000527 -0.0000889 0.0627553 0.2559558 0.3216566 0.000068 -0.2701418 0.3554487 0.0000829 -0.0000345 0.0000791 -0.1252245 1.8999865 0.2179621 0.0000144 0.2002154 1.3877563 0.0001617 -0.0000425 0.0001791 0.2631142 0.1002118 0.0242922 0.0000009 0.0471767 0.0836001 -0.0000122 -0.0000001 -0.0000149 0.1645357 0.0371793 0.0618343 0.0000101 0.0642254 -0.0077324 -0.0000353 0.0000136 -0.00004 0.2058552 0.3927978 -0.096984 -0.0000124 -0.052254 0.0804734 -0.0000422 -0.0000182 -0.0000439 0.3993168 0.2229183 0.1046633 0.0000338 0.1669407 0.2886131 -0.0000254 0.0000555 -0.0000245 0.4082784 unknown
polarizability: 124.3472179|5.4440777|96.3469505|0.0000854|0.0101452|33.1884408 unknown
InChI: InChI=1S/C6H4O5/c7-3-1-5(6(9)10)11-2-4(3)8/h1-2,8-9H
charge 0 multiplicity 1
15 atoms
O  0.427813 1.337637 0.000378
O  -3.244246 0.699414 0.000259
O  -2.22562 -1.899424 -0.000161
O  3.03841 1.09917 0.000274
O  2.962235 -1.229182 -0.000146
C  0.890541 0.025063 0.000186
C  0.038736 -1.054536 0.000002
C  -1.426296 -0.913403 -0.000042
C  -1.869567 0.510923 0.000214
C  -0.953899 1.542391 0.000388
C  2.376117 -0.122692 0.000186
H  0.462713 -2.062505 -0.000135
H  -1.193616 2.608527 0.000565
H  -3.494345 1.658988 0.000385
H  4.021024 0.93763 0.000147
