program: Orca
programVersion: 5.0.2
elementType: Br Br Br Br O O O N C C C C C C C C C C C C C C C C C C C C C C H H H H H H H H H H H H H H H H H H H
charge: 0
multiplicity: 1
keywords: wb97x-d3
keywords: def2-TZVPP
keywords: def2/J RIJCOSX
keywords: DEFGRID2
keywords: scfconv7
keywords: smallprint printgap noloewdin
keywords: NOSOSCF
formula: C22H19Br4NO3
InChI: InChI=1/C22H19Br4NO3/c1-21(2)17(19(23)22(24,25)26)18(21)20(28)30-16(12-27)13-7-6-10-15(11-13)29-14-8-4-3-5-9-14/h3-11,16-19H,1-2H3
49 atoms
Br 3.639814 -0.674317 1.950753
Br 1.955013 -3.578892 1.049842
Br 1.253251 -2.277473 -1.705166
Br 4.246144 -2.557483 -0.851273
O  -1.944044 0.44424 -1.111606
O  -1.882441 -0.823985 0.727634
O  -4.682499 4.373506 0.938144
N  -3.999302 0.904073 -3.651991
C  0.65828 1.029879 1.235392
C  1.031164 -0.384876 0.924343
C  0.082263 0.342529 0.007434
C  2.393172 -0.782719 0.438395
C  1.604626 2.16939 0.945459
C  -0.19627 1.272508 2.453908
C  -1.322575 -0.093373 -0.050136
C  2.464692 -2.186339 -0.187811
C  -3.335755 0.170073 -1.233885
C  -4.162403 0.937667 -0.230279
C  -3.687103 0.581288 -2.593408
C  -4.013631 2.317317 -0.143855
C  -5.05122 0.263218 0.591784
C  -4.788512 3.022608 0.764625
C  -5.808594 0.982564 1.50576
C  -5.686259 2.35867 1.59307
C  -4.367041 5.199322 -0.113986
C  -4.921156 5.037415 -1.377947
C  -3.515454 6.260181 0.157718
C  -4.601079 5.946343 -2.376284
C  -3.215772 7.168914 -0.847302
C  -3.750785 7.013582 -2.118626
H  0.560492 -1.110247 1.58005
H  0.47897 0.716882 -0.929374
H  2.765117 -0.076762 -0.309299
H  2.285262 2.328979 1.782239
H  2.200446 2.018276 0.045789
H  1.035767 3.08944 0.803149
H  0.446214 1.4658 3.314047
H  -0.829805 2.149322 2.310718
H  -0.835095 0.429714 2.708506
H  -3.536618 -0.902944 -1.152747
H  -3.305223 2.831325 -0.783061
H  -5.15204 -0.811718 0.519735
H  -6.503684 0.467441 2.15479
H  -6.280587 2.920557 2.302088
H  -5.596538 4.218253 -1.589682
H  -3.097196 6.376783 1.149411
H  -5.029188 5.81929 -3.36191
H  -2.554604 7.998078 -0.632442
H  -3.510047 7.719817 -2.901769
elementType: Br O N C H
nucrepener: 5517.53079444 hartree
twoeener: 9921.16381619 hartree
cpcmener: -0.03575943 hartree
xcener: -389.800498261453 hartree
chargesum: -0.0000000
charge: -0.081891 -0.013189 -0.012333 -0.001931 -0.279992 -0.451647 -0.335868 -0.100552 0.097327 -0.094615 -0.145843 -0.149617 -0.263087 -0.263217 0.397651 0.033182 0.441863 0.022813 -0.225100 -0.237964 -0.207755 0.279162 -0.110889 -0.243293 0.308499 -0.209908 -0.264116 -0.139766 -0.117604 -0.192438 0.117922 0.122387 0.169186 0.099170 0.093544 0.108961 0.101607 0.104220 0.094429 0.145717 0.149275 0.149584 0.162677 0.151000 0.157783 0.148983 0.162969 0.161283 0.161423
qa: -0.0819 -0.0132 -0.0123 -0.0019 -0.2800 -0.4516 -0.3359 -0.1006 0.0973 -0.0946 -0.1458 -0.1496 -0.2631 -0.2632 0.3977 0.0332 0.4419 0.0228 -0.2251 -0.2380 -0.2078 0.2792 -0.1109 -0.2433 0.3085 -0.2099 -0.2641 -0.1398 -0.1176 -0.1924 0.1179 0.1224 0.1692 0.0992 0.0935 0.1090 0.1016 0.1042 0.0944 0.1457 0.1493 0.1496 0.1627 0.1510 0.1578 0.1490 0.1630 0.1613 0.1614
va: 1.1821 1.2224 1.2257 1.2302 2.1307 2.0593 2.0741 3.1079 3.8775 3.7428 3.8713 4.0524 3.8991 3.9004 4.1568 4.3541 3.6953 3.5822 4.0862 3.9491 3.9656 3.7311 3.8941 4.0078 3.6595 3.9143 4.0135 3.8781 3.8725 3.9055 1.0455 1.0223 0.9930 1.0052 1.0041 1.0028 1.0029 0.9997 1.0169 1.0150 1.0151 1.0038 0.9879 1.0045 0.9973 1.0077 0.9888 0.9880 0.9894
dispcorr: -0.029681703 hartree
energy: -11427.159640035798
dipole: -137.16933 137.35057 0.18124 128.64303 -127.52037 1.12266 2.22054 -1.44326 0.77729
magnitude: 1.37746 au
magnitude: 3.50122 debye
