program: Orca
programVersion: 5.0.2
elementType: Br Br Br Br O O O N C C C C C C C C C C C C C C C C C C C C C C H H H H H H H H H H H H H H H H H H H
charge: 0
multiplicity: 1
keywords: wb97x-d3
keywords: def2-TZVPP
keywords: def2/J RIJCOSX
keywords: DEFGRID2
keywords: scfconv7
keywords: smallprint printgap noloewdin
keywords: NOSOSCF
formula: C22H19Br4NO3
InChI: InChI=1/C22H19Br4NO3/c1-21(2)17(19(23)22(24,25)26)18(21)20(28)30-16(12-27)13-7-6-10-15(11-13)29-14-8-4-3-5-9-14/h3-11,16-19H,1-2H3
49 atoms
Br 3.738408 0.513797 0.011882
Br 2.511803 -1.115362 2.800517
Br 1.047309 -3.157021 0.935362
Br 4.150066 -2.81356 0.71966
O  -2.435789 -1.17815 -0.948654
O  -1.838588 -0.215923 0.979207
O  -3.956399 3.321409 -2.469685
N  -5.132464 -2.601663 -2.223909
C  0.431026 0.803162 -1.061439
C  0.96744 -0.060944 0.037995
C  -0.216597 -0.539635 -0.756404
C  2.274489 -0.791053 -0.06639
C  1.129953 0.895319 -2.395588
C  -0.244552 2.091958 -0.660337
C  -1.540611 -0.614809 -0.117003
C  2.492044 -1.85949 1.018058
C  -3.792382 -1.126192 -0.534523
C  -4.346152 0.282202 -0.546563
C  -4.52104 -1.963681 -1.48797
C  -3.910802 1.188578 -1.503726
C  -5.278861 0.657549 0.40859
C  -4.407973 2.482577 -1.488755
C  -5.784099 1.949583 0.39476
C  -5.35386 2.871027 -0.546849
C  -3.795668 4.659713 -2.198582
C  -4.269928 5.562693 -3.137569
C  -3.130245 5.095936 -1.059518
C  -4.072718 6.921781 -2.934535
C  -2.953196 6.457846 -0.863272
C  -3.421495 7.375007 -1.7959
H  0.735936 0.308437 1.032079
H  -0.03786 -1.292479 -1.516469
H  2.367169 -1.287203 -1.036442
H  1.887084 1.679641 -2.381208
H  1.609402 -0.036273 -2.695193
H  0.406121 1.151181 -3.170757
H  -0.991552 2.382983 -1.401075
H  -0.730521 2.040715 0.312123
H  0.49866 2.889267 -0.611191
H  -3.923559 -1.574287 0.456417
H  -3.183019 0.910091 -2.256188
H  -5.604808 -0.050156 1.159845
H  -6.516723 2.248118 1.132299
H  -5.755211 3.876122 -0.541439
H  -4.783664 5.204867 -4.020808
H  -2.748241 4.386871 -0.334647
H  -4.440245 7.627004 -3.668394
H  -2.437986 6.801823 0.023994
H  -3.276529 8.435168 -1.637019
elementType: Br O N C H
nucrepener: 5543.24031989 hartree
twoeener: 9946.58005929 hartree
cpcmener: -0.03719709 hartree
xcener: -389.799742840868 hartree
chargesum: 0.0000000
charge: -0.083066 -0.013600 -0.012903 -0.002101 -0.277610 -0.440111 -0.341804 -0.099313 0.120447 -0.086679 -0.150833 -0.163401 -0.267651 -0.272028 0.381977 0.037983 0.419260 0.018298 -0.222515 -0.255247 -0.200350 0.248738 -0.132398 -0.171587 0.284209 -0.243570 -0.181402 -0.130002 -0.161985 -0.177503 0.116209 0.123796 0.169282 0.099224 0.094676 0.110388 0.093442 0.099599 0.108453 0.148791 0.145199 0.147539 0.163493 0.160567 0.148759 0.162415 0.161101 0.162339 0.161474
qa: -0.0831 -0.0136 -0.0129 -0.0021 -0.2776 -0.4401 -0.3418 -0.0993 0.1204 -0.0867 -0.1508 -0.1634 -0.2677 -0.2720 0.3820 0.0380 0.4193 0.0183 -0.2225 -0.2552 -0.2003 0.2487 -0.1324 -0.1716 0.2842 -0.2436 -0.1814 -0.1300 -0.1620 -0.1775 0.1162 0.1238 0.1693 0.0992 0.0947 0.1104 0.0934 0.0996 0.1085 0.1488 0.1452 0.1475 0.1635 0.1606 0.1488 0.1624 0.1611 0.1623 0.1615
va: 1.1817 1.2222 1.2246 1.2297 2.1182 2.0646 2.0442 3.1106 3.8617 3.7532 3.8537 4.0705 3.8950 3.8915 4.1784 4.3558 3.6922 3.6180 4.0821 4.0077 3.9879 3.7749 3.8981 3.9030 3.6508 4.0178 3.8932 3.8834 3.9073 3.8922 1.0454 1.0239 0.9926 1.0049 1.0032 1.0033 1.0028 1.0140 1.0051 1.0136 1.0221 1.0017 0.9889 0.9940 1.0067 0.9933 0.9882 0.9898 0.9889
dispcorr: -0.031183915 hartree
energy: -11427.160675591618
dipole: -140.26276 140.43114 0.16837 104.60487 -102.73135 1.87352 -61.09448 61.15349 0.05901
magnitude: 1.88199 au
magnitude: 4.78365 debye
