program: Orca
programVersion: 5.0.2
elementType: Br Br Br Br O O O N C C C C C C C C C C C C C C C C C C C C C C H H H H H H H H H H H H H H H H H H H
charge: 0
multiplicity: 1
keywords: wb97x-d3
keywords: def2-TZVPP
keywords: def2/J RIJCOSX
keywords: DEFGRID2
keywords: scfconv7
keywords: smallprint printgap noloewdin
keywords: NOSOSCF
formula: C22H19Br4NO3
InChI: InChI=1/C22H19Br4NO3/c1-21(2)17(19(23)22(24,25)26)18(21)20(28)30-16(12-27)13-7-6-10-15(11-13)29-14-8-4-3-5-9-14/h3-11,16-19H,1-2H3
49 atoms
Br 3.817806 0.689058 0.055955
Br 2.655659 -1.575239 2.373819
Br 0.810307 -2.849905 0.179675
Br 3.907098 -2.71536 -0.281062
O  -2.464514 -0.538211 -0.596166
O  -1.732985 0.256986 1.366091
O  -4.741169 3.876734 -1.296494
N  -4.69058 -2.835432 -1.367548
C  0.463786 1.532588 -0.551683
C  1.014211 0.374028 0.215056
C  -0.279208 0.206228 -0.542595
C  2.216015 -0.404908 -0.232195
C  1.049463 1.934151 -1.883712
C  -0.065027 2.70848 0.230637
C  -1.526767 -0.00127 0.208592
C  2.396733 -1.761954 0.468975
C  -3.745511 -0.783994 -0.050706
C  -4.68437 0.400716 -0.184438
C  -4.265074 -1.933124 -0.795819
C  -4.246842 1.61537 -0.685877
C  -6.008501 0.243515 0.215482
C  -5.144648 2.673323 -0.772324
C  -6.893343 1.301215 0.098255
C  -6.46591 2.528783 -0.390408
C  -3.701545 4.540994 -0.692043
C  -3.505251 4.516917 0.683441
C  -2.873918 5.293968 -1.513908
C  -2.470726 5.263231 1.231568
C  -1.847527 6.037969 -0.950021
C  -1.639903 6.026626 0.422908
H  0.908337 0.470083 1.291158
H  -0.230512 -0.327731 -1.484528
H  2.177519 -0.594528 -1.308246
H  1.893644 2.609728 -1.743279
H  1.386864 1.088195 -2.481775
H  0.2966 2.464246 -2.468881
H  -0.410864 2.445878 1.227739
H  0.724058 3.453355 0.343881
H  -0.890042 3.180042 -0.305938
H  -3.678191 -1.083985 1.001001
H  -3.229878 1.763754 -1.026406
H  -6.352474 -0.703979 0.612119
H  -7.924204 1.175187 0.400061
H  -7.152136 3.361254 -0.474839
H  -4.151728 3.935462 1.32872
H  -3.037295 5.30101 -2.584139
H  -2.32056 5.24854 2.303166
H  -1.204045 6.624911 -1.592292
H  -0.836912 6.606002 0.858359
elementType: Br O N C H
nucrepener: 5637.95035317 hartree
cpcmener: -0.03584080 hartree
xcener: -389.800166406993 hartree
chargesum: -0.0000000
charge: -0.080968 -0.012862 -0.012204 -0.002173 -0.277103 -0.444763 -0.343532 -0.099139 0.134483 -0.083501 -0.148738 -0.167482 -0.269096 -0.254276 0.378538 0.039289 0.415451 0.031043 -0.217445 -0.154856 -0.226657 0.207963 -0.123227 -0.206860 0.258326 -0.164272 -0.217383 -0.165592 -0.128436 -0.191237 0.120737 0.120887 0.169925 0.100241 0.096125 0.107906 0.102290 0.107590 0.054072 0.145580 0.155268 0.151243 0.162646 0.151273 0.153990 0.147811 0.160882 0.159025 0.159219
qa: -0.0810 -0.0129 -0.0122 -0.0022 -0.2771 -0.4448 -0.3435 -0.0991 0.1345 -0.0835 -0.1487 -0.1675 -0.2691 -0.2543 0.3785 0.0393 0.4155 0.0310 -0.2174 -0.1549 -0.2267 0.2080 -0.1232 -0.2069 0.2583 -0.1643 -0.2174 -0.1656 -0.1284 -0.1912 0.1207 0.1209 0.1699 0.1002 0.0961 0.1079 0.1023 0.1076 0.0541 0.1456 0.1553 0.1512 0.1626 0.1513 0.1540 0.1478 0.1609 0.1590 0.1592
va: 1.1839 1.2226 1.2283 1.2303 2.1068 2.0589 2.0522 3.1105 3.8525 3.7476 3.8933 4.0747 3.9010 3.8823 4.1310 4.3456 3.6946 3.6467 4.0469 3.9605 3.9933 3.7890 3.8894 4.0034 3.6854 3.8362 3.9572 3.8539 3.8670 3.8561 1.0430 1.0259 0.9913 1.0049 1.0043 1.0023 1.0172 1.0041 1.0182 1.0201 0.9999 1.0015 0.9882 1.0025 0.9998 1.0070 0.9909 0.9886 0.9909
dispcorr: -0.032708771 hartree
energy: -11427.162186012134
dipole: -135.30151 135.44058 0.13907 105.72873 -103.89749 1.83125 -24.85250 24.84570 -0.00680
magnitude: 1.83653 au
magnitude: 4.66810 debye
