program: Orca
programVersion: 5.0.2
elementType: Br Br Br Br O O O N C C C C C C C C C C C C C C C C C C C C C C H H H H H H H H H H H H H H H H H H H
charge: 0
multiplicity: 1
keywords: wb97x-d3
keywords: def2-TZVPP
keywords: def2/J RIJCOSX
keywords: DEFGRID2
keywords: scfconv7
keywords: smallprint printgap noloewdin
keywords: NOSOSCF
formula: C22H19Br4NO3
InChI: InChI=1/C22H19Br4NO3/c1-21(2)17(19(23)22(24,25)26)18(21)20(28)30-16(12-27)13-7-6-10-15(11-13)29-14-8-4-3-5-9-14/h3-11,16-19H,1-2H3
49 atoms
Br 3.291053 0.096896 -1.145005
Br 0.605411 1.555106 0.459574
Br 0.522486 -0.875128 2.461246
Br 3.127459 0.835509 2.206102
O  -1.716087 -2.118937 -0.419571
O  -1.373723 -4.278093 0.050709
O  -3.45765 2.637019 -0.486096
N  -3.835538 -3.141962 -2.82215
C  1.253426 -2.713013 -1.548509
C  1.033912 -1.523042 -0.663308
C  0.506769 -2.864635 -0.237354
C  2.134376 -0.868142 0.116812
C  2.597337 -3.3949 -1.623892
C  0.494302 -2.742342 -2.852186
C  -0.934856 -3.179788 -0.181844
C  1.639272 0.102313 1.203062
C  -3.117082 -2.307605 -0.446785
C  -3.814984 -1.001664 -0.146292
C  -3.504026 -2.782957 -1.780561
C  -3.24155 0.215765 -0.497012
C  -5.061801 -1.056937 0.458529
C  -3.941878 1.386257 -0.233563
C  -5.746433 0.122086 0.714254
C  -5.195024 1.342697 0.368681
C  -2.418548 2.859665 -1.355901
C  -2.385852 2.30962 -2.630396
C  -1.429584 3.738147 -0.93412
C  -1.33272 2.629423 -3.475968
C  -0.388924 4.058106 -1.796093
C  -0.331458 3.498802 -3.064823
H  0.298154 -0.828459 -1.052931
H  1.065585 -3.40561 0.519033
H  2.772799 -1.611938 0.601331
H  3.227328 -2.924436 -2.379327
H  3.136862 -3.384889 -0.676941
H  2.464617 -4.439592 -1.909395
H  1.082735 -2.259333 -3.633628
H  0.308648 -3.770895 -3.165847
H  -0.464821 -2.227139 -2.802003
H  -3.433108 -3.063177 0.278144
H  -2.266681 0.247317 -0.964298
H  -5.493651 -2.011318 0.731419
H  -6.716754 0.090504 1.190756
H  -5.724057 2.264448 0.574053
H  -3.169394 1.643431 -2.968617
H  -1.486742 4.182014 0.052237
H  -1.304476 2.199073 -4.468376
H  0.379692 4.745653 -1.468751
H  0.482982 3.744728 -3.732791
elementType: Br O N C H
nucrepener: 5997.06664967 hartree
cpcmener: -0.03635481 hartree
xcener: -389.802302964733 hartree
chargesum: 0.0000000
charge: -0.089050 -0.024398 -0.020514 -0.010531 -0.248032 -0.451450 -0.324604 -0.097815 0.099694 -0.078890 -0.184637 -0.154389 -0.276577 -0.256272 0.426987 0.069289 0.357601 0.007474 -0.212594 -0.212595 -0.218339 0.344343 -0.108683 -0.253000 0.335385 -0.214620 -0.330773 -0.141136 -0.103748 -0.170846 0.119202 0.130485 0.169328 0.098932 0.092879 0.109186 0.101090 0.106670 0.083862 0.139021 0.119932 0.148076 0.161732 0.148915 0.161711 0.164686 0.163126 0.161894 0.161996
qa: -0.0890 -0.0244 -0.0205 -0.0105 -0.2480 -0.4515 -0.3246 -0.0978 0.0997 -0.0789 -0.1846 -0.1544 -0.2766 -0.2563 0.4270 0.0693 0.3576 0.0075 -0.2126 -0.2126 -0.2183 0.3443 -0.1087 -0.2530 0.3354 -0.2146 -0.3308 -0.1411 -0.1037 -0.1708 0.1192 0.1305 0.1693 0.0989 0.0929 0.1092 0.1011 0.1067 0.0839 0.1390 0.1199 0.1481 0.1617 0.1489 0.1617 0.1647 0.1631 0.1619 0.1620
va: 1.1780 1.2332 1.2222 1.2267 2.1533 2.0508 2.0897 3.1035 3.8759 3.7149 3.9179 4.0412 3.9038 3.9059 4.1426 4.3275 3.7457 3.8086 4.0302 3.9624 3.9757 3.6603 3.8946 3.9891 3.5786 3.9100 3.9129 3.8688 3.8077 3.8926 1.0196 1.0168 0.9927 1.0046 1.0035 1.0025 1.0040 1.0016 1.0112 1.0277 1.0175 1.0003 0.9878 1.0070 0.9951 1.0046 0.9882 0.9888 0.9873
dispcorr: -0.034463974 hartree
energy: -11427.162146985533
dipole: -83.21308 83.88281 0.66974 -25.54220 26.10907 0.56688 -60.94666 61.47224 0.52559
magnitude: 1.02281 au
magnitude: 2.59977 debye
