program: Orca
programVersion: 5.0.2
elementType: Br Br Br Br O O O N C C C C C C C C C C C C C C C C C C C C C C H H H H H H H H H H H H H H H H H H H
charge: 0
multiplicity: 1
keywords: wb97x-d3
keywords: def2-TZVPP
keywords: def2/J RIJCOSX
keywords: DEFGRID2
keywords: scfconv7
keywords: smallprint printgap noloewdin
keywords: NOSOSCF
formula: C22H19Br4NO3
InChI: InChI=1/C22H19Br4NO3/c1-21(2)17(19(23)22(24,25)26)18(21)20(28)30-16(12-27)13-7-6-10-15(11-13)29-14-8-4-3-5-9-14/h3-11,16-19H,1-2H3
49 atoms
Br 3.557495 -3.261519 -0.863237
Br 3.652348 -1.164612 1.884739
Br 0.549425 -1.489143 2.200263
Br 2.391747 -4.016056 2.276418
O  -1.355771 0.906492 -0.598042
O  0.750703 1.64252 -0.595916
O  -6.024852 4.346035 -1.62711
N  -1.045643 2.928886 2.106201
C  1.163631 -1.086423 -2.200345
C  1.703183 -1.147349 -0.808492
C  0.288558 -0.671409 -1.028328
C  1.957462 -2.43585 -0.084057
C  0.721672 -2.339366 -2.917488
C  1.749122 -0.05313 -3.129192
C  -0.030743 0.733882 -0.729163
C  2.146917 -2.289525 1.435063
C  -1.811143 2.215924 -0.29392
C  -3.318126 2.225646 -0.353752
C  -1.362885 2.601289 1.050034
C  -3.944499 3.281813 -0.999417
C  -4.05887 1.218668 0.253649
C  -5.33283 3.319661 -1.050275
C  -5.442518 1.27269 0.193159
C  -6.084874 2.313749 -0.459474
C  -5.474754 5.061333 -2.665588
C  -4.918199 4.431657 -3.771682
C  -5.556346 6.443557 -2.598025
C  -4.432018 5.206679 -4.814448
C  -5.077897 7.205822 -3.654973
C  -4.508998 6.592685 -4.762148
H  2.416108 -0.360175 -0.584755
H  -0.510656 -1.370251 -0.81025
H  1.141781 -3.145813 -0.246289
H  1.565919 -2.815198 -3.417118
H  0.258086 -3.07382 -2.259465
H  -0.012487 -2.083204 -3.68253
H  2.114771 0.831186 -2.612079
H  2.591457 -0.488036 -3.669267
H  1.01028 0.26365 -3.866522
H  -1.404655 2.946852 -0.999082
H  -3.347195 4.064068 -1.451602
H  -3.571335 0.401202 0.768546
H  -6.031897 0.491955 0.65469
H  -7.165669 2.349398 -0.507065
H  -4.865531 3.351488 -3.826815
H  -5.996026 6.917584 -1.729786
H  -3.996234 4.719632 -5.676794
H  -5.14513 8.284549 -3.604565
H  -4.131022 7.189615 -5.581266
elementType: Br O N C H
nucrepener: 5438.52850934 hartree
twoeener: 9842.47023981 hartree
cpcmener: -0.03980543 hartree
xcener: -389.800232608277 hartree
chargesum: 0.0000000
charge: -0.083202 -0.013843 -0.015319 -0.001686 -0.274744 -0.453001 -0.336408 -0.100848 0.090822 -0.096071 -0.141341 -0.149451 -0.259876 -0.261098 0.402252 0.039985 0.430465 -0.003276 -0.233132 -0.173521 -0.215984 0.269250 -0.140674 -0.221865 0.285541 -0.198592 -0.245456 -0.142766 -0.126766 -0.184941 0.117283 0.124655 0.171522 0.097571 0.094706 0.109057 0.093928 0.100084 0.105775 0.135351 0.146408 0.148493 0.161874 0.150994 0.161725 0.148799 0.162907 0.161857 0.162554
qa: -0.0832 -0.0138 -0.0153 -0.0017 -0.2747 -0.4530 -0.3364 -0.1008 0.0908 -0.0961 -0.1413 -0.1495 -0.2599 -0.2611 0.4023 0.0400 0.4305 -0.0033 -0.2331 -0.1735 -0.2160 0.2692 -0.1407 -0.2219 0.2855 -0.1986 -0.2455 -0.1428 -0.1268 -0.1849 0.1173 0.1247 0.1715 0.0976 0.0947 0.1091 0.0939 0.1001 0.1058 0.1354 0.1464 0.1485 0.1619 0.1510 0.1617 0.1488 0.1629 0.1619 0.1626
va: 1.1814 1.2214 1.2266 1.2300 2.1576 2.0497 2.0722 3.1097 3.8749 3.7359 3.8972 4.0584 3.9009 3.9009 4.1467 4.3453 3.7048 3.7437 4.0184 3.9413 3.9743 3.7400 3.9288 3.9941 3.6705 3.9240 4.0116 3.8816 3.8770 3.8981 1.0468 1.0185 0.9918 1.0060 1.0039 1.0027 1.0167 1.0018 1.0000 1.0217 1.0061 1.0112 0.9888 1.0045 0.9946 1.0068 0.9889 0.9880 0.9890
dispcorr: -0.028436112 hartree
energy: -11427.159073398994
dipole: -126.25482 124.63052 -1.62429 116.61824 -117.55542 -0.93718 -92.12088 89.08068 -3.04020
magnitude: 3.57203 au
magnitude: 9.07938 debye
