program: Orca
programVersion: 5.0.2
elementType: Br Br Br Br O O O N C C C C C C C C C C C C C C C C C C C C C C H H H H H H H H H H H H H H H H H H H
charge: 0
multiplicity: 1
keywords: wb97x-d3
keywords: def2-TZVPP
keywords: def2/J RIJCOSX
keywords: DEFGRID2
keywords: scfconv7
keywords: smallprint printgap noloewdin
keywords: NOSOSCF
formula: C22H19Br4NO3
InChI: InChI=1/C22H19Br4NO3/c1-21(2)17(19(23)22(24,25)26)18(21)20(28)30-16(12-27)13-7-6-10-15(11-13)29-14-8-4-3-5-9-14/h3-11,16-19H,1-2H3
49 atoms
Br 3.729455 -0.460794 -0.344983
Br 0.956618 1.47783 0.21892
Br -0.197358 -0.709374 2.136519
Br 2.603663 0.565738 2.744716
O  -1.491906 -2.2935 -1.328853
O  -1.752732 -3.72483 0.367593
O  -2.542121 2.745293 -0.235063
N  -3.491511 -1.541128 -3.853743
C  1.503252 -3.040218 -1.25369
C  1.212169 -1.766016 -0.527904
C  0.432995 -3.016955 -0.179577
C  2.106646 -1.159872 0.51335
C  2.721505 -3.865997 -0.912981
C  1.146765 -3.101438 -2.71902
C  -1.030961 -3.073235 -0.342289
C  1.434122 -0.035908 1.323256
C  -2.891711 -2.031668 -1.359526
C  -3.218284 -0.851935 -0.477458
C  -3.210708 -1.757341 -2.761466
C  -2.716575 0.401978 -0.810143
C  -3.959867 -1.03609 0.679065
C  -2.998922 1.485642 0.007255
C  -4.21244 0.054143 1.501714
C  -3.745269 1.312939 1.168068
C  -2.2704 3.173929 -1.506173
C  -3.111998 2.905184 -2.579463
C  -1.138803 3.959138 -1.676775
C  -2.791403 3.404329 -3.833365
C  -0.835716 4.459877 -2.93518
C  -1.652512 4.176367 -4.020268
H  0.676707 -1.040908 -1.131532
H  0.734433 -3.518489 0.733483
H  2.44492 -1.919151 1.223535
H  3.587168 -3.533984 -1.486696
H  2.983821 -3.830841 0.144274
H  2.540749 -4.912275 -1.165574
H  2.017249 -2.820708 -3.314462
H  0.863932 -4.115468 -3.006517
H  0.336571 -2.43183 -2.997499
H  -3.471065 -2.909466 -1.058584
H  -2.118506 0.526774 -1.704879
H  -4.340519 -2.016056 0.936076
H  -4.790004 -0.076019 2.407338
H  -3.953995 2.16462 1.803381
H  -4.010118 2.3148 -2.448122
H  -0.512016 4.198425 -0.826618
H  -3.444998 3.1893 -4.668897
H  0.04803 5.071357 -3.06378
H  -1.409811 4.56092 -5.002068
elementType: Br O N C H
nucrepener: 6034.84031855 hartree
cpcmener: -0.02922878 hartree
xcener: -389.804575561487 hartree
chargesum: -0.0000000
charge: -0.082555 -0.027639 -0.014429 -0.007913 -0.271170 -0.424272 -0.314275 -0.087245 0.103119 -0.109906 -0.109970 -0.161717 -0.266683 -0.259249 0.357414 0.081409 0.402355 0.038004 -0.234785 -0.248520 -0.199502 0.296460 -0.105875 -0.247863 0.312190 -0.216125 -0.272258 -0.130575 -0.116821 -0.189141 0.122604 0.115099 0.166030 0.099478 0.090523 0.108902 0.096699 0.104104 0.091949 0.138433 0.141205 0.143780 0.157783 0.146058 0.155249 0.154419 0.160122 0.157559 0.157542
qa: -0.0826 -0.0276 -0.0144 -0.0079 -0.2712 -0.4243 -0.3143 -0.0872 0.1031 -0.1099 -0.1100 -0.1617 -0.2667 -0.2592 0.3574 0.0814 0.4024 0.0380 -0.2348 -0.2485 -0.1995 0.2965 -0.1059 -0.2479 0.3122 -0.2161 -0.2723 -0.1306 -0.1168 -0.1891 0.1226 0.1151 0.1660 0.0995 0.0905 0.1089 0.0967 0.1041 0.0919 0.1384 0.1412 0.1438 0.1578 0.1461 0.1552 0.1544 0.1601 0.1576 0.1575
va: 1.1818 1.2250 1.2315 1.2274 2.1169 2.0781 2.0820 3.1036 3.8753 3.7202 3.8617 4.0697 3.9059 3.9025 4.2022 4.2969 3.7528 3.5994 4.0680 3.9389 3.9482 3.6943 3.8899 4.0262 3.6658 3.9241 3.9897 3.8774 3.9092 3.9238 1.0323 1.0236 0.9927 1.0053 1.0043 1.0025 1.0024 1.0005 1.0137 1.0188 1.0122 1.0086 0.9889 1.0062 0.9985 1.0048 0.9895 0.9905 0.9906
dispcorr: -0.035541995 hartree
energy: -11427.177249655935
dipole: -75.24187 75.78728 0.54541 -18.81639 18.29590 -0.52049 -67.02549 67.50808 0.48259
magnitude: 0.89514 au
magnitude: 2.27526 debye
