program: Orca
programVersion: 5.0.2
elementType: Br Br Br Br O O O N C C C C C C C C C C C C C C C C C C C C C C H H H H H H H H H H H H H H H H H H H
charge: 0
multiplicity: 1
keywords: wb97x-d3
keywords: def2-TZVPP
keywords: def2/J RIJCOSX
keywords: DEFGRID2
keywords: scfconv7
keywords: smallprint printgap noloewdin
keywords: NOSOSCF
formula: C22H19Br4NO3
InChI: InChI=1/C22H19Br4NO3/c1-21(2)17(19(23)22(24,25)26)18(21)20(28)30-16(12-27)13-7-6-10-15(11-13)29-14-8-4-3-5-9-14/h3-11,16-19H,1-2H3
49 atoms
Br 3.482253 -1.802202 -1.441181
Br 3.211128 0.937311 0.65141
Br 1.464016 -0.773041 2.615436
Br 4.349872 -1.7257 1.879825
O  -2.532593 -1.090071 0.854746
O  -1.45618 0.588486 -0.153304
O  -5.579352 2.823171 -2.29152
N  -5.225891 -1.460914 2.732506
C  -0.012123 -1.961219 -1.431726
C  0.892319 -1.142029 -0.563081
C  -0.4443 -1.578966 -0.025112
C  2.16669 -1.685995 0.012971
C  0.237718 -3.433823 -1.651449
C  -0.625103 -1.284593 -2.632548
C  -1.487328 -0.560879 0.200241
C  2.762808 -0.867704 1.172248
C  -3.659831 -0.239921 1.035269
C  -4.390583 0.01628 -0.262183
C  -4.523779 -0.941602 1.986769
C  -4.646035 1.324424 -0.643124
C  -4.774557 -1.048941 -1.068029
C  -5.274486 1.568812 -1.857818
C  -5.416556 -0.789443 -2.268552
C  -5.661187 0.513992 -2.673176
C  -4.780772 3.893497 -1.987963
C  -3.392796 3.820798 -2.009363
C  -5.423391 5.093184 -1.717127
C  -2.65275 4.963781 -1.742101
C  -4.669566 6.230352 -1.465708
C  -3.283032 6.17053 -1.469942
H  0.943738 -0.097164 -0.852993
H  -0.464542 -2.409912 0.671412
H  2.029346 -2.707109 0.37868
H  0.634985 -3.94256 -0.772897
H  -0.699718 -3.93007 -1.909045
H  0.930269 -3.593174 -2.478704
H  -1.60407 -1.71211 -2.858186
H  -0.746118 -0.210257 -2.508821
H  0.011864 -1.44083 -3.504792
H  -3.366232 0.707391 1.499869
H  -4.345107 2.140037 0.002592
H  -4.578445 -2.070879 -0.767672
H  -5.722164 -1.609509 -2.904671
H  -6.15177 0.714806 -3.61732
H  -2.8846 2.889758 -2.228824
H  -6.505441 5.135387 -1.709382
H  -1.571942 4.90633 -1.754054
H  -5.17355 7.165497 -1.257896
H  -2.69773 7.057376 -1.265708
elementType: Br O N C H
nucrepener: 5548.00979114 hartree
twoeener: 9951.26751092 hartree
cpcmener: -0.03060189 hartree
xcener: -389.799832240078 hartree
chargesum: 0.0000000
charge: -0.082120 -0.011812 -0.012199 -0.001106 -0.269485 -0.426878 -0.324573 -0.086000 0.096490 -0.087048 -0.148631 -0.155389 -0.265443 -0.257219 0.379242 0.034211 0.404074 0.033662 -0.225048 -0.207321 -0.252814 0.297106 -0.112863 -0.231128 0.299530 -0.203580 -0.256264 -0.141443 -0.116675 -0.186742 0.117060 0.120332 0.167548 0.092988 0.108742 0.099414 0.100705 0.093295 0.101713 0.139285 0.145465 0.145976 0.159309 0.148527 0.158296 0.145290 0.158463 0.157610 0.157448
qa: -0.0821 -0.0118 -0.0122 -0.0011 -0.2695 -0.4269 -0.3246 -0.0860 0.0965 -0.0870 -0.1486 -0.1554 -0.2654 -0.2572 0.3792 0.0342 0.4041 0.0337 -0.2250 -0.2073 -0.2528 0.2971 -0.1129 -0.2311 0.2995 -0.2036 -0.2563 -0.1414 -0.1167 -0.1867 0.1171 0.1203 0.1675 0.0930 0.1087 0.0994 0.1007 0.0933 0.1017 0.1393 0.1455 0.1460 0.1593 0.1485 0.1583 0.1453 0.1585 0.1576 0.1574
va: 1.1824 1.2224 1.2252 1.2303 2.1343 2.0850 2.0909 3.1125 3.8758 3.7401 3.8656 4.0586 3.8969 3.9013 4.1927 4.3519 3.7339 3.5714 4.0733 3.9478 3.9714 3.7269 3.8974 4.0123 3.6828 3.9124 4.0141 3.8923 3.8791 3.9116 1.0445 1.0224 0.9941 1.0041 1.0026 1.0056 1.0015 1.0149 1.0039 1.0177 1.0062 1.0120 0.9889 1.0054 0.9971 1.0087 0.9906 0.9890 0.9906
dispcorr: -0.030080177 hartree
energy: -11427.175355814516
dipole: -155.04739 155.43893 0.39154 37.00425 -37.37767 -0.37342 -59.72385 58.36783 -1.35602
magnitude: 1.45998 au
magnitude: 3.71096 debye
