program: Orca
programVersion: 5.0.2
elementType: Br Br Br Br O O O N C C C C C C C C C C C C C C C C C C C C C C H H H H H H H H H H H H H H H H H H H
charge: 0
multiplicity: 1
keywords: wb97x-d3
keywords: def2-TZVPP
keywords: def2/J RIJCOSX
keywords: DEFGRID2
keywords: scfconv7
keywords: smallprint printgap noloewdin
keywords: NOSOSCF
formula: C22H19Br4NO3
InChI: InChI=1/C22H19Br4NO3/c1-21(2)17(19(23)22(24,25)26)18(21)20(28)30-16(12-27)13-7-6-10-15(11-13)29-14-8-4-3-5-9-14/h3-11,16-19H,1-2H3
49 atoms
Br 3.77691 -0.569448 -1.275061
Br 3.098649 -0.121162 2.088104
Br 0.847878 -2.294471 1.891625
Br 3.788176 -3.02873 1.106461
O  -2.483566 -0.678114 0.194976
O  -1.324772 1.223395 0.43272
O  -5.489121 3.532561 -1.844275
N  -4.60908 -1.98496 2.365461
C  0.3846 0.013075 -1.900182
C  1.074365 -0.203692 -0.591871
C  -0.367715 -0.62685 -0.744642
C  2.144879 -1.239105 -0.412329
C  0.645682 -0.901994 -3.073237
C  0.109523 1.436456 -2.318934
C  -1.401877 0.096506 0.017103
C  2.46144 -1.616978 1.044203
C  -3.612325 -0.10235 0.8546
C  -4.601758 0.40102 -0.165726
C  -4.162591 -1.167366 1.694066
C  -4.590024 1.75143 -0.491011
C  -5.457046 -0.475916 -0.822557
C  -5.429712 2.216439 -1.495628
C  -6.30866 0.008601 -1.802522
C  -6.29281 1.349933 -2.151416
C  -4.350557 4.29256 -1.888615
C  -3.15014 3.804728 -2.39202
C  -4.458521 5.608943 -1.463597
C  -2.051064 4.649338 -2.455186
C  -3.353833 6.444579 -1.544696
C  -2.145004 5.968721 -2.033021
H  1.223406 0.704869 -0.016604
H  -0.560835 -1.685381 -0.874749
H  1.885683 -2.164136 -0.933312
H  1.510008 -0.563993 -3.645805
H  0.81643 -1.9392 -2.784865
H  -0.215938 -0.894816 -3.74287
H  0.931221 1.792228 -2.943062
H  -0.805037 1.495315 -2.912128
H  0.018438 2.122343 -1.480272
H  -3.30668 0.708022 1.52245
H  -3.931481 2.430237 0.036917
H  -5.470464 -1.529603 -0.572774
H  -6.984068 -0.666543 -2.311006
H  -6.949848 1.726704 -2.925157
H  -3.065402 2.78208 -2.73855
H  -5.401557 5.975592 -1.077728
H  -1.115736 4.270387 -2.847377
H  -3.440881 7.472132 -1.215848
H  -1.283882 6.621499 -2.088559
elementType: Br O N C H
nucrepener: 5577.13228026 hartree
twoeener: 9980.26430036 hartree
cpcmener: -0.02955672 hartree
xcener: -389.799826646517 hartree
chargesum: -0.0000000
charge: -0.080099 -0.011036 -0.011447 -0.002769 -0.268707 -0.438224 -0.326739 -0.086446 0.121848 -0.086036 -0.172633 -0.162796 -0.260735 -0.300775 0.416517 0.038622 0.394500 -0.005328 -0.221118 -0.165758 -0.204514 0.265058 -0.125941 -0.225858 0.297547 -0.211281 -0.253883 -0.136226 -0.114196 -0.195048 0.122362 0.117397 0.166504 0.098721 0.092907 0.109298 0.103725 0.107438 0.100016 0.133599 0.145451 0.140588 0.159958 0.148282 0.159540 0.145330 0.167818 0.157304 0.157266
qa: -0.0801 -0.0110 -0.0114 -0.0028 -0.2687 -0.4382 -0.3267 -0.0864 0.1218 -0.0860 -0.1726 -0.1628 -0.2607 -0.3008 0.4165 0.0386 0.3945 -0.0053 -0.2211 -0.1658 -0.2045 0.2651 -0.1259 -0.2259 0.2975 -0.2113 -0.2539 -0.1362 -0.1142 -0.1950 0.1224 0.1174 0.1665 0.0987 0.0929 0.1093 0.1037 0.1074 0.1000 0.1336 0.1455 0.1406 0.1600 0.1483 0.1595 0.1453 0.1678 0.1573 0.1573
va: 1.1842 1.2216 1.2282 1.2283 2.1243 2.0730 2.0865 3.1100 3.8343 3.7322 3.9273 4.0726 3.8993 3.8978 4.1428 4.3398 3.7431 3.6987 4.0660 3.9045 3.9944 3.7526 3.9160 4.0253 3.7057 3.9163 4.0143 3.8726 3.8857 3.9376 1.0400 1.0247 0.9946 1.0063 1.0046 1.0022 1.0042 0.9942 1.0130 1.0240 1.0162 1.0097 0.9897 1.0052 0.9927 1.0083 0.9840 0.9886 0.9919
dispcorr: -0.030843722 hartree
energy: -11427.175965576040
dipole: -140.65683 140.74443 0.08760 81.80801 -81.20654 0.60147 -67.02924 64.79336 -2.23588
magnitude: 2.31703 au
magnitude: 5.88942 debye
