program: Gaussian 09
title: 000068131
version: EM64L-G09RevD.01
frameworkgroup: C1[X(C7H6N2O5)]
method: RPBEPBE
basis: SDD
operation: Freq
keyword: #pfreq=noraman
keyword: PBEPBE/SDD
title: #p freq=noraman PBEPBE/SDD
converged: YES YES YES YES
title: Mulliken charges:
elementType: O O O O O N N C C C C C C C H H H H H H
charge: -0.434192 -0.188337 -0.187012 -0.183540 -0.200510 0.019255 0.017517 0.215286 0.306808 0.275096 0.491556 -0.560621 -0.598875 -0.764488 0.339037 0.288877 0.257286 0.272005 0.257249 0.377603
chargesum: 0.00000
title: Mulliken charges with hydrogens summed into heavy atoms:
elementType: O O O O O N N C C C C C C C
charge: -0.056590 -0.188337 -0.187012 -0.183540 -0.200510 0.019255 0.017517 0.215286 0.306808 0.275096 0.491556 -0.221584 -0.309998 0.022052
polarizability: 1.65888998e+02 3.39895398e+00 1.41474123e+02 1.55195087e-03 -2.60629003e-03 4.61115150e+01
1716.lowfreq: -30.2824 -6.5443 -0.0003 -0.0003 0.0008 1.1950 4.6681 57.1705 89.0021
frequency: -30.2002 57.1690 89.0011 131.5899 156.9403 212.9206 217.5081 251.2205 313.4406 334.1709 348.0908 363.9185 379.7898 399.4835 452.0142 490.1413 544.9367 546.9482 619.7565 663.5908 684.1495 703.8973 734.2961 737.9513 755.0874 873.6476 901.4671 932.8024 953.4443 1027.0746 1033.8663 1076.8637 1122.7777 1188.6259 1202.7123 1207.2460 1228.0654 1262.8555 1367.9114 1378.3336 1392.6823 1409.7862 1418.8281 1463.2863 1468.2654 1485.9637 1602.3031 1605.5878 3008.5268 3080.6920 3140.3921 3157.2225 3202.2538 3588.8061
redmass: 9.8226 14.4469 3.7999 8.4711 12.6114 1.0630 4.5711 8.0469 3.4903 11.7223 10.7464 3.2147 1.2037 6.1767 11.6359 4.9980 7.7833 5.5430 4.1204 9.3326 6.3540 3.5058 11.7528 6.4637 5.9353 7.0074 1.5281 5.3779 1.4744 1.6897 1.5451 1.8851 1.5382 4.7418 2.8383 7.9819 2.1019 3.6182 6.1644 11.4040 1.4829 3.0917 4.0971 1.0465 1.2366 3.6271 8.3343 7.6852 1.0385 1.0950 1.0997 1.0926 1.0921 1.0663
irintensity: 0.1212 0.3466 0.0273 3.4659 4.1486 0.2558 0.1482 1.5141 26.3294 1.4572 0.8932 6.5750 129.2580 4.9486 0.0928 7.2174 1.5158 0.0423 6.5144 26.2604 3.0486 21.4398 25.6835 0.4577 19.7912 20.0282 21.5668 21.4760 33.2012 22.7738 5.7173 75.9164 178.0695 181.7187 49.7819 293.0782 4.2963 80.7683 64.0343 79.4760 57.5877 23.6654 96.6093 16.7812 18.6203 64.0490 20.8562 14.5326 0.6215 4.0412 8.3459 7.0355 26.2666 62.3522
temp: 298.150 k
press: 1.00000 atm
elementType: 8 8 8 8 8 7 7 6 6 6 6 6 6 6 1 1 1 1 1 1
symmnumber: 1
zpe: 346739.4 jmol-1
zpe.correction: 0.132066 hartree
zpe.thermalcorrener: 0.143609 hartree
zpe.thermalcorrenthalpy: 0.144554 hartree
zpe.thermalcorrgfe: 0.094229 hartree
zpe.sumelectzpe: -754.774236 hartree
zpe.sumelectthermal: -754.762692 hartree
zpe.sumelectthermalent: -754.761748 hartree
zpe.sumelectthermalfe: -754.812072 hartree
dipole: 0.5598 5.6841 0.0011
dipole: 5.7116
quadrupole: -100.7425 -79.5394 -78.1772
quadrupole: -1.3505 0.0009 -0.0009
quadrupole: -14.5895 6.6136 7.9758 -1.3505 0.0009 -0.0009
hfenergy: -754.9063018 hartree
pointgroup: C01 [X(C7H6N2O5)]
dipole: 0.1602654 2.2414102 0.0004295 debye
dipolederiv: -0.0429374 -0.0900565 0.0000126 -0.149431 -1.433768 0.0000077 0.0000103 0.0000493 -0.4128803 -0.4872589 0.0454503 0.0001097 0.0236963 -0.8285664 0.0002573 0.000049 -0.0000487 -0.2166632 -0.8052784 -0.0519864 0.0000834 0.0302771 -0.4720027 0.000021 0.0002791 0.0001648 -0.1997324 -0.5975597 -0.1656542 -0.0000301 -0.2001711 -0.7313344 0.0000366 -0.0000537 -0.0000778 -0.2089321 -0.8468167 0.1487344 -0.0000128 0.1321104 -0.5334478 -0.0000307 -0.0001215 0.0000626 -0.2239303 1.3360649 -0.2482876 -0.0002818 -0.2972585 1.3448315 -0.0002975 -0.0002323 -0.0002504 0.1743006 1.7731199 0.1838887 0.0001116 0.2528842 1.0867665 0.0000171 0.0001424 -0.0000138 0.1800601 0.5160876 0.4744406 0.0000527 -0.1373525 -0.0219825 0.0000077 0.0000227 0.0000228 -0.0112383 -0.2940041 0.2040473 0.0000575 0.1391808 -0.2229213 0.0000098 -0.0000462 0.0000791 0.0622481 -0.4677117 -0.0048849 -0.0000393 0.2189716 1.4425977 -0.0000223 -0.000037 -0.0000829 0.1015381 -0.5630535 -0.0982763 -0.0000607 -0.2504475 -0.0310837 -0.0000289 -0.0000186 0.0000102 0.096153 0.1211102 -0.1063809 0.0000192 -0.0414125 -0.2527189 -0.0000251 -0.0000372 0.0000908 -0.1057427 0.065307 -0.2286823 0.000014 0.3163192 -0.1357938 0.0000209 0.0000313 -0.0000013 -0.1478073 -0.3442616 -0.2395335 -0.00001 0.0148023 0.0643856 0.000029 0.0001076 0.0000647 0.013701 0.1799006 -0.0100568 -0.0000055 -0.0194619 0.1529237 0. 0.0000236 -0.0000101 0.1890676 0.1158082 0.0683073 -0.0000055 0.0344743 0.0598929 0.0000052 -0.0000063 0.0000109 0.1818638 0.0736511 0.0134769 0.0544072 -0.0121294 0.0601598 -0.0647847 0.0598255 -0.0467172 0.0063215 0.1216511 0.0388323 0.0000028 -0.044315 -0.0560554 -0.000041 -0.0000371 -0.0000553 0.1199907 0.0736269 0.0135156 -0.0544125 -0.0121054 0.0600826 0.0648161 -0.0598928 0.0467094 0.0063142 0.0725544 0.0531061 -0.0000126 0.0013687 0.4480346 0.000002 -0.0000089 -0.0000069 0.3953683 unknown
polarizability: 165.689412|4.0479542|141.6737096|0.0016212|-0.0025638|46.111515 unknown
InChI: InChI=1S/C7H6N2O5/c1-4-6(9(13)14)2-5(8(11)12)3-7(4)10/h2-3,10H,1H3
charge 0 multiplicity 1
20 atoms
O  0.354669 3.173875 -0.000037
O  1.729033 -2.71594 0.000242
O  3.29363 -1.069062 -0.000526
O  -2.959087 -1.899034 -0.000235
O  -3.762085 0.237914 -0.000308
N  2.069006 -1.471383 0.000241
N  -2.797289 -0.621351 -0.000057
C  1.249203 0.943667 0.000105
C  0.970747 -0.454429 0.000145
C  0.098591 1.799051 0.0000
C  -1.409093 -0.093208 0.0000
C  -0.335667 -0.991512 0.000097
C  -1.218343 1.302153 -0.00006
C  2.62048 1.579656 0.000204
H  -0.495839 -2.071189 0.000148
H  -2.095013 1.95888 -0.000138
H  3.208013 1.259398 -0.877473
H  2.525514 2.673854 0.000393
H  3.208048 1.259068 0.877732
H  -0.482318 3.701292 -0.000071
