program: Orca
programVersion: 5.0.2
elementType: Br Br Br Br O O O N C C C C C C C C C C C C C C C C C C C C C C H H H H H H H H H H H H H H H H H H H
charge: 0
multiplicity: 1
keywords: wb97x-d3
keywords: def2-TZVPP
keywords: def2/J RIJCOSX
keywords: DEFGRID2
keywords: scfconv7
keywords: smallprint printgap noloewdin
keywords: NOSOSCF
formula: C22H19Br4NO3
InChI: InChI=1/C22H19Br4NO3/c1-21(2)17(19(23)22(24,25)26)18(21)20(28)30-16(12-27)13-7-6-10-15(11-13)29-14-8-4-3-5-9-14/h3-11,16-19H,1-2H3
49 atoms
Br 3.719739 -1.362978 -1.463371
Br 3.288753 0.863388 1.163628
Br 1.169162 -1.088368 2.404502
Br 4.074617 -2.10137 1.859262
O  -2.442944 -0.712684 0.314856
O  -1.279257 1.073034 -0.370939
O  -5.19765 3.11582 -2.916694
N  -4.89038 -1.114327 2.491552
C  0.275776 -1.165258 -1.966366
C  1.071047 -0.668474 -0.801544
C  -0.348726 -1.12063 -0.583123
C  2.214085 -1.441623 -0.212463
C  0.504006 -2.549457 -2.527664
C  -0.110917 -0.160046 -3.023821
C  -1.366418 -0.11392 -0.219179
C  2.668758 -0.961398 1.175461
C  -3.550314 0.128888 0.624925
C  -4.395322 0.391029 -0.597828
C  -4.29791 -0.578553 1.66648
C  -4.394482 1.663074 -1.15499
C  -5.122501 -0.638184 -1.178505
C  -5.142724 1.908538 -2.300012
C  -5.860201 -0.380787 -2.323678
C  -5.876103 0.882988 -2.886454
C  -4.5829 4.192731 -2.330208
C  -5.237494 4.900452 -1.33353
C  -3.3249 4.574124 -2.766806
C  -4.619838 6.007047 -0.771286
C  -2.718065 5.685309 -2.199954
C  -3.360776 6.401347 -1.201239
H  1.206128 0.408489 -0.787601
H  -0.499549 -2.091995 -0.126057
H  1.964361 -2.501094 -0.113795
H  1.307997 -2.541779 -3.263595
H  0.756567 -3.289046 -1.767867
H  -0.401692 -2.898743 -3.025307
H  -0.242132 0.843869 -2.628027
H  0.669293 -0.118755 -3.785139
H  -1.040612 -0.453034 -3.514231
H  -3.20414 1.076751 1.048638
H  -3.800003 2.445533 -0.7023
H  -5.126151 -1.627419 -0.738962
H  -6.437082 -1.172951 -2.781665
H  -6.455352 1.086538 -3.777431
H  -6.221465 4.588558 -1.007549
H  -2.830461 4.005867 -3.543753
H  -5.127063 6.564318 0.004926
H  -1.736451 5.988159 -2.538975
H  -2.883319 7.266146 -0.760931
nucrepener: 5543.24385077 hartree
twoeener: 9946.84191411 hartree
xcener: -389.812393957645 hartree
chargesum: -0.0000000
charge: -0.060698 0.001138 -0.005075 0.008485 -0.252356 -0.376257 -0.294427 -0.001396 0.074865 -0.070725 -0.170912 -0.180309 -0.246495 -0.247101 0.378495 0.034182 0.309678 -0.028356 -0.258607 -0.113325 -0.190833 0.240215 -0.090587 -0.196634 0.189890 -0.146567 -0.137767 -0.129421 -0.121204 -0.110583 0.120734 0.102230 0.150279 0.100491 0.075694 0.103861 0.097065 0.095862 0.094319 0.118803 0.118485 0.120737 0.128480 0.127429 0.129900 0.123694 0.129429 0.127003 0.128194
qa: -0.0607 0.0011 -0.0051 0.0085 -0.2524 -0.3763 -0.2944 -0.0014 0.0749 -0.0707 -0.1709 -0.1803 -0.2465 -0.2471 0.3785 0.0342 0.3097 -0.0284 -0.2586 -0.1133 -0.1908 0.2402 -0.0906 -0.1966 0.1899 -0.1466 -0.1378 -0.1294 -0.1212 -0.1106 0.1207 0.1022 0.1503 0.1005 0.0757 0.1039 0.0971 0.0959 0.0943 0.1188 0.1185 0.1207 0.1285 0.1274 0.1299 0.1237 0.1294 0.1270 0.1282
va: 1.2026 1.2350 1.2358 1.2409 2.1320 2.1274 2.1187 3.1198 3.8840 3.6984 3.9340 4.1154 3.9018 3.9082 4.1830 4.3589 3.8445 3.7052 4.0227 3.8832 4.0471 3.8671 3.9484 4.0389 3.8556 3.9911 4.0085 3.9492 3.9521 3.9357 1.0455 1.0283 1.0024 1.0085 1.0083 1.0049 1.0209 1.0038 1.0012 1.0194 1.0303 1.0157 0.9993 1.0133 1.0062 1.0098 0.9997 1.0002 0.9997
dispcorr: -0.029467772 hartree
energy: -11427.144136802654
dipole: -150.50658 150.66166 0.15508 53.30590 -52.96468 0.34122 -70.09836 68.73236 -1.36600
magnitude: 1.41649 au
magnitude: 3.60043 debye
