program: Orca
programVersion: 5.0.2
elementType: Br Br Br Br O O O N C C C C C C C C C C C C C C C C C C C C C C H H H H H H H H H H H H H H H H H H H
charge: 0
multiplicity: 1
keywords: wb97x-d3
keywords: def2-TZVPP
keywords: def2/J RIJCOSX
keywords: DEFGRID2
keywords: scfconv7
keywords: smallprint printgap noloewdin
keywords: NOSOSCF
formula: C22H19Br4NO3
InChI: InChI=1/C22H19Br4NO3/c1-21(2)17(19(23)22(24,25)26)18(21)20(28)30-16(12-27)13-7-6-10-15(11-13)29-14-8-4-3-5-9-14/h3-11,16-19H,1-2H3
49 atoms
Br 3.62709 -1.716212 -1.30852
Br 3.239972 0.648974 1.213233
Br 1.072323 -1.197715 2.533495
Br 3.955809 -2.300525 2.044846
O  -2.403262 -0.599817 0.596411
O  -1.232728 1.004975 -0.438457
O  -5.264479 2.67016 -2.953493
N  -4.426055 -0.493384 3.20105
C  0.169845 -1.449706 -1.813861
C  1.00874 -0.904468 -0.703921
C  -0.434949 -1.249918 -0.436215
C  2.116028 -1.686992 -0.06212
C  0.314616 -2.890525 -2.246989
C  -0.166615 -0.525839 -2.959061
C  -1.364024 -0.145598 -0.121884
C  2.578478 -1.159042 1.306207
C  -3.405725 0.350653 0.949067
C  -4.44046 0.472643 -0.142237
C  -3.977623 -0.13307 2.207125
C  -4.375708 1.556897 -1.006865
C  -5.400513 -0.515505 -0.319292
C  -5.289037 1.656515 -2.049652
C  -6.297864 -0.409156 -1.369283
C  -6.251043 0.671984 -2.233407
C  -4.788484 3.898638 -2.581066
C  -3.816688 4.48601 -3.374839
C  -5.295604 4.56322 -1.471586
C  -3.349878 5.752728 -3.05538
C  -4.812568 5.823387 -1.157266
C  -3.839081 6.422383 -1.944535
H  1.20462 0.160273 -0.782693
H  -0.636312 -2.167659 0.103763
H  1.830148 -2.731636 0.084169
H  1.127641 -2.998754 -2.965142
H  0.507739 -3.574444 -1.420431
H  -0.604521 -3.225645 -2.729339
H  -1.116476 -0.808033 -3.415775
H  -0.234128 0.516801 -2.660054
H  0.607293 -0.604218 -3.723945
H  -2.952637 1.327391 1.144323
H  -3.60732 2.307814 -0.875353
H  -5.45745 -1.356895 0.359423
H  -7.051813 -1.171383 -1.511903
H  -6.95539 0.761487 -3.049813
H  -3.43579 3.953499 -4.236163
H  -6.062048 4.102404 -0.861353
H  -2.592588 6.212715 -3.67609
H  -5.205644 6.342112 -0.292995
H  -3.467805 7.406981 -1.694899
nucrepener: 5527.41620450 hartree
twoeener: 9931.02402191 hartree
xcener: -389.812108528911 hartree
chargesum: -0.0000000
charge: -0.060186 0.001465 -0.004156 0.008452 -0.252156 -0.384396 -0.296650 -0.001783 0.076797 -0.078064 -0.176994 -0.175321 -0.243311 -0.249156 0.390495 0.033453 0.310371 -0.013786 -0.257225 -0.118341 -0.175338 0.206551 -0.094232 -0.197743 0.226962 -0.190918 -0.162641 -0.096318 -0.113605 -0.136257 0.122619 0.103266 0.150903 0.100157 0.074988 0.103008 0.092993 0.100846 0.095263 0.122790 0.133231 0.120900 0.129541 0.129437 0.125366 0.134186 0.127271 0.129603 0.127663
qa: -0.0602 0.0015 -0.0042 0.0085 -0.2522 -0.3844 -0.2967 -0.0018 0.0768 -0.0781 -0.1770 -0.1753 -0.2433 -0.2492 0.3905 0.0335 0.3104 -0.0138 -0.2572 -0.1183 -0.1753 0.2066 -0.0942 -0.1977 0.2270 -0.1909 -0.1626 -0.0963 -0.1136 -0.1363 0.1226 0.1033 0.1509 0.1002 0.0750 0.1030 0.0930 0.1008 0.0953 0.1228 0.1332 0.1209 0.1295 0.1294 0.1254 0.1342 0.1273 0.1296 0.1277
va: 1.2032 1.2347 1.2376 1.2412 2.1285 2.1177 2.1138 3.1179 3.8809 3.7016 3.9512 4.1109 3.9024 3.9071 4.1645 4.3489 3.8379 3.6951 4.0204 3.8720 4.0441 3.8803 3.9495 4.0395 3.8215 4.0443 3.9623 3.9371 3.9463 3.9606 1.0438 1.0276 1.0023 1.0086 1.0090 1.0050 1.0016 1.0209 1.0033 1.0188 1.0246 1.0160 0.9995 1.0116 1.0131 1.0033 0.9990 0.9995 1.0001
dispcorr: -0.029154235 hartree
energy: -11427.144007929088
dipole: -152.92076 152.76101 -0.15975 55.62669 -55.57806 0.04863 -70.97773 69.52333 -1.45439
magnitude: 1.46395 au
magnitude: 3.72106 debye
