program: Orca
programVersion: 5.0.2
elementType: Br Br Br Br O O O N C C C C C C C C C C C C C C C C C C C C C C H H H H H H H H H H H H H H H H H H H
charge: 0
multiplicity: 1
keywords: wb97x-d3
keywords: def2-TZVPP
keywords: def2/J RIJCOSX
keywords: DEFGRID2
keywords: scfconv7
keywords: smallprint printgap noloewdin
keywords: NOSOSCF
formula: C22H19Br4NO3
InChI: InChI=1/C22H19Br4NO3/c1-21(2)17(19(23)22(24,25)26)18(21)20(28)30-16(12-27)13-7-6-10-15(11-13)29-14-8-4-3-5-9-14/h3-11,16-19H,1-2H3
49 atoms
Br 3.594039 -2.490233 -0.983159
Br 3.528548 0.552855 0.655049
Br 1.296916 -0.571939 2.561991
Br 4.057126 -2.023865 2.380284
O  -2.355949 -0.587643 0.604823
O  -1.074715 0.711013 -0.689827
O  -5.015295 3.019148 -3.146202
N  -4.815759 -0.080348 2.749029
C  0.155248 -2.105256 -1.462461
C  1.061165 -1.323919 -0.566281
C  -0.378565 -1.518792 -0.167791
C  2.159278 -1.956065 0.237378
C  0.225814 -3.613846 -1.509874
C  -0.204049 -1.489458 -2.79279
C  -1.265415 -0.337715 -0.141276
C  2.734119 -1.061105 1.347966
C  -3.313248 0.4603 0.680631
C  -4.144266 0.56729 -0.575283
C  -4.149398 0.142205 1.84057
C  -4.188699 1.771963 -1.257514
C  -4.843216 -0.538441 -1.044068
C  -4.958654 1.878967 -2.40989
C  -5.589379 -0.424766 -2.204972
C  -5.657669 0.779815 -2.887309
C  -5.003734 4.239016 -2.528644
C  -5.784469 4.504834 -1.410477
C  -4.223028 5.233957 -3.097042
C  -5.77142 5.777672 -0.861755
C  -4.228814 6.505624 -2.544304
C  -4.997404 6.78262 -1.423746
H  1.293245 -0.330087 -0.936204
H  -0.587879 -2.249817 0.60505
H  1.817634 -2.877038 0.716386
H  0.97715 -3.943483 -2.227342
H  0.465579 -4.066318 -0.54765
H  -0.736964 -4.019318 -1.823856
H  0.53242 -1.786675 -3.540523
H  -1.181292 -1.838888 -3.129995
H  -0.228866 -0.403003 -2.765457
H  -2.819284 1.417619 0.877399
H  -3.615043 2.618857 -0.902023
H  -4.811636 -1.477632 -0.506845
H  -6.137928 -1.278741 -2.578866
H  -6.246548 0.874942 -3.789955
H  -6.402998 3.730678 -0.9745
H  -3.622401 5.00897 -3.9684
H  -6.380206 5.984699 0.008358
H  -3.621268 7.281509 -2.990923
H  -4.996406 7.774346 -0.992513
nucrepener: 5485.67113300 hartree
twoeener: 9889.18387972 hartree
xcener: -389.812418246683 hartree
chargesum: 0.0000000
charge: -0.060046 0.001684 -0.006475 0.008395 -0.258360 -0.363977 -0.297804 0.000531 0.076558 -0.077898 -0.162076 -0.175750 -0.246118 -0.242827 0.356702 0.034465 0.310628 0.022882 -0.254192 -0.108947 -0.202141 0.202871 -0.092788 -0.191315 0.237792 -0.165101 -0.206152 -0.115156 -0.090582 -0.143165 0.122218 0.102489 0.149180 0.100733 0.076596 0.102558 0.095139 0.090350 0.100822 0.118856 0.118194 0.124179 0.129773 0.130268 0.136252 0.126702 0.129986 0.126918 0.127149
qa: -0.0600 0.0017 -0.0065 0.0084 -0.2584 -0.3640 -0.2978 0.0005 0.0766 -0.0779 -0.1621 -0.1758 -0.2461 -0.2428 0.3567 0.0345 0.3106 0.0229 -0.2542 -0.1089 -0.2021 0.2029 -0.0928 -0.1913 0.2378 -0.1651 -0.2062 -0.1152 -0.0906 -0.1432 0.1222 0.1025 0.1492 0.1007 0.0766 0.1026 0.0951 0.0903 0.1008 0.1189 0.1182 0.1242 0.1298 0.1303 0.1363 0.1267 0.1300 0.1269 0.1271
va: 1.2030 1.2355 1.2371 1.2408 2.1278 2.1453 2.1131 3.1203 3.8816 3.7054 3.9191 4.1118 3.9029 3.9071 4.1992 4.3581 3.8537 3.6344 4.0195 3.9276 4.0297 3.8866 3.9401 4.0365 3.8098 3.9450 4.0419 3.9481 3.9330 3.9627 1.0455 1.0283 1.0030 1.0082 1.0078 1.0053 1.0036 1.0028 1.0208 1.0196 1.0191 1.0174 0.9989 1.0110 1.0029 1.0134 0.9994 0.9987 1.0000
dispcorr: -0.029069528 hartree
energy: -11427.143115188894
dipole: -159.47901 159.41473 -0.06428 51.59495 -51.78973 -0.19479 -69.70552 68.53800 -1.16752
magnitude: 1.18540 au
magnitude: 3.01306 debye
