program: Orca
programVersion: 5.0.2
elementType: Br Br Br Br O O O N C C C C C C C C C C C C C C C C C C C C C C H H H H H H H H H H H H H H H H H H H
charge: 0
multiplicity: 1
keywords: wb97x-d3
keywords: def2-TZVPP
keywords: def2/J RIJCOSX
keywords: DEFGRID2
keywords: scfconv7
keywords: smallprint printgap noloewdin
keywords: NOSOSCF
formula: C22H19Br4NO3
InChI: InChI=1/C22H19Br4NO3/c1-21(2)17(19(23)22(24,25)26)18(21)20(28)30-16(12-27)13-7-6-10-15(11-13)29-14-8-4-3-5-9-14/h3-11,16-19H,1-2H3
49 atoms
Br 3.425421 -1.530907 -1.405918
Br 3.097149 1.097136 0.821683
Br 1.335957 -0.742285 2.661415
Br 4.248161 -1.608077 1.927156
O  -2.607377 -1.074724 0.864232
O  -1.586398 0.69291 -0.05415
O  -5.557978 2.765338 -2.319473
N  -5.224087 -1.614098 2.80199
C  -0.047135 -1.712775 -1.4688
C  0.821367 -0.940764 -0.52502
C  -0.511601 -1.446627 -0.04761
C  2.097714 -1.497974 0.033646
C  0.252537 -3.156921 -1.796183
C  -0.656183 -0.962756 -2.628897
C  -1.585195 -0.4710 0.235929
C  2.663693 -0.733315 1.242762
C  -3.765588 -0.27891 1.094666
C  -4.531876 -0.023729 -0.180819
C  -4.571456 -1.036759 2.054102
C  -4.685919 1.2786 -0.627564
C  -5.04315 -1.089481 -0.909921
C  -5.34685 1.519255 -1.825805
C  -5.714916 -0.836196 -2.094373
C  -5.862985 0.459881 -2.560419
C  -4.692158 3.789916 -2.054027
C  -3.312393 3.630694 -2.095618
C  -5.252049 5.032576 -1.797617
C  -2.4984 4.729438 -1.867305
C  -4.425285 6.124645 -1.584928
C  -3.046608 5.978189 -1.613253
H  0.852187 0.125554 -0.725275
H  -0.522062 -2.320963 0.593711
H  1.971446 -2.537143 0.348125
H  -0.665302 -3.66478 -2.095776
H  0.958715 -3.228989 -2.623316
H  0.666214 -3.715532 -0.956568
H  0.020742 -1.001887 -3.483343
H  -1.601264 -1.417659 -2.930259
H  -0.844883 0.084674 -2.405532
H  -3.490634 0.673255 1.560221
H  -4.275301 2.097516 -0.051392
H  -4.928424 -2.105638 -0.554736
H  -6.124669 -1.656887 -2.667491
H  -6.380436 0.659609 -3.489375
H  -2.871037 2.6625 -2.294412
H  -6.32869 5.137408 -1.772722
H  -1.424325 4.60298 -1.892681
H  -4.864895 7.093418 -1.388193
H  -2.403613 6.830148 -1.439498
nucrepener: 5571.71401087 hartree
twoeener: 9974.95783717 hartree
xcener: -389.812413043843 hartree
chargesum: 0.0000000
charge: -0.060796 0.000777 -0.006539 0.009944 -0.250212 -0.368038 -0.294750 0.000844 0.070471 -0.069876 -0.161530 -0.177112 -0.249273 -0.232477 0.354844 0.032617 0.313437 0.029384 -0.256593 -0.158377 -0.213710 0.255032 -0.084622 -0.204299 0.262915 -0.177181 -0.216523 -0.111376 -0.088660 -0.143732 0.121562 0.103139 0.149781 0.103787 0.101331 0.076675 0.098619 0.093315 0.083768 0.118205 0.121457 0.123389 0.129551 0.129282 0.134571 0.125948 0.127943 0.126784 0.126308
qa: -0.0608 0.0008 -0.0065 0.0099 -0.2502 -0.3680 -0.2947 0.0008 0.0705 -0.0699 -0.1615 -0.1771 -0.2493 -0.2325 0.3548 0.0326 0.3134 0.0294 -0.2566 -0.1584 -0.2137 0.2550 -0.0846 -0.2043 0.2629 -0.1772 -0.2165 -0.1114 -0.0887 -0.1437 0.1216 0.1031 0.1498 0.1038 0.1013 0.0767 0.0986 0.0933 0.0838 0.1182 0.1215 0.1234 0.1296 0.1293 0.1346 0.1259 0.1279 0.1268 0.1263
va: 1.2027 1.2342 1.2343 1.2413 2.1374 2.1376 2.1250 3.1186 3.8980 3.7014 3.9069 4.1101 3.9012 3.9035 4.2190 4.3611 3.8459 3.6139 4.0190 3.9344 4.0350 3.8640 3.9303 4.0391 3.7851 3.9551 4.0434 3.9526 3.9299 3.9627 1.0433 1.0277 1.0027 1.0047 1.0081 1.0080 1.0054 1.0029 1.0221 1.0180 1.0164 1.0175 0.9989 1.0121 0.9986 1.0143 0.9999 0.9987 1.0002
dispcorr: -0.030233636 hartree
energy: -11427.143869236454
dipole: -152.85585 153.20446 0.34861 34.31574 -34.28301 0.03273 -62.14033 60.89340 -1.24693
magnitude: 1.29516 au
magnitude: 3.29204 debye
