program: Orca
programVersion: 5.0.2
elementType: Br Br Br Br O O O N C C C C C C C C C C C C C C C C C C C C C C H H H H H H H H H H H H H H H H H H H
charge: 0
multiplicity: 1
keywords: wb97x-d3
keywords: def2-TZVPP
keywords: def2/J RIJCOSX
keywords: DEFGRID2
keywords: scfconv7
keywords: smallprint printgap noloewdin
keywords: NOSOSCF
formula: C22H19Br4NO3
InChI: InChI=1/C22H19Br4NO3/c1-21(2)17(19(23)22(24,25)26)18(21)20(28)30-16(12-27)13-7-6-10-15(11-13)29-14-8-4-3-5-9-14/h3-11,16-19H,1-2H3
49 atoms
Br 3.551592 -1.28331 -0.6186
Br 0.918348 0.877642 -1.098317
Br -0.154011 0.187013 1.767119
Br 2.725767 1.362919 1.431052
O  -1.768962 -2.895385 -0.334521
O  -2.049578 -3.252514 1.856853
O  -2.531112 2.080939 -1.468485
N  -3.770383 -3.182175 -2.946662
C  1.171507 -3.739748 0.139346
C  0.985504 -2.259966 0.039544
C  0.152101 -3.04785 1.022006
C  1.976111 -1.253877 0.543401
C  2.360187 -4.318204 0.872274
C  0.754252 -4.577837 -1.045809
C  -1.321745 -3.093578 0.917802
C  1.421599 0.179462 0.629532
C  -3.156602 -2.604675 -0.474914
C  -3.417693 -1.15596 -0.143785
C  -3.4884 -2.926226 -1.863337
C  -2.891802 -0.16243 -0.955414
C  -4.111265 -0.827564 1.013128
C  -3.066064 1.172781 -0.615293
C  -4.2843 0.507325 1.339353
C  -3.76825 1.51257 0.536542
C  -2.549898 3.41009 -1.130945
C  -1.619237 3.913827 -0.233983
C  -3.48781 4.238412 -1.725395
C  -1.630725 5.268097 0.062729
C  -3.487646 5.592534 -1.422811
C  -2.563697 6.109452 -0.526943
H  0.464695 -1.946457 -0.858634
H  0.449179 -2.986357 2.063074
H  2.334122 -1.517446 1.541863
H  3.218836 -4.407861 0.207069
H  2.669825 -3.724193 1.732335
H  2.117118 -5.315413 1.241724
H  1.599923 -4.686029 -1.726119
H  0.455285 -5.577112 -0.725656
H  -0.067484 -4.146123 -1.610873
H  -3.755278 -3.252296 0.172585
H  -2.346729 -0.408021 -1.859111
H  -4.500745 -1.604522 1.656638
H  -4.828716 0.775595 2.234749
H  -3.917308 2.548049 0.810591
H  -0.891506 3.253678 0.220176
H  -4.203792 3.823796 -2.422978
H  -0.903473 5.666806 0.75742
H  -4.215941 6.243319 -1.888278
H  -2.566599 7.165417 -0.292716
nucrepener: 6018.95295194 hartree
xcener: -389.816076724008 hartree
chargesum: 0.0000000
charge: -0.058504 -0.005818 -0.012992 0.003852 -0.267465 -0.341307 -0.288713 0.001788 0.088176 -0.091995 -0.115818 -0.153542 -0.250962 -0.243567 0.314639 0.044237 0.313000 0.049563 -0.275737 -0.258953 -0.129984 0.253278 -0.129525 -0.163626 0.196916 -0.112914 -0.134916 -0.156435 -0.128582 -0.108326 0.113260 0.102954 0.147908 0.100518 0.075596 0.105198 0.093899 0.094110 0.096658 0.122892 0.116216 0.115625 0.130310 0.128840 0.104989 0.128799 0.129759 0.128507 0.128194
qa: -0.0585 -0.0058 -0.0130 0.0039 -0.2675 -0.3413 -0.2887 0.0018 0.0882 -0.0920 -0.1158 -0.1535 -0.2510 -0.2436 0.3146 0.0442 0.3130 0.0496 -0.2757 -0.2590 -0.1300 0.2533 -0.1295 -0.1636 0.1969 -0.1129 -0.1349 -0.1564 -0.1286 -0.1083 0.1133 0.1030 0.1479 0.1005 0.0756 0.1052 0.0939 0.0941 0.0967 0.1229 0.1162 0.1156 0.1303 0.1288 0.1050 0.1288 0.1298 0.1285 0.1282
va: 1.2038 1.2343 1.2282 1.2383 2.0995 2.1610 2.0995 3.1139 3.8686 3.6831 3.8801 4.0787 3.9151 3.9084 4.2600 4.3242 3.8484 3.6165 4.0245 4.0490 3.9883 3.8534 3.9861 3.9313 3.7863 3.9536 4.0179 4.0092 3.9564 3.9244 1.0444 1.0251 1.0030 1.0077 1.0076 1.0045 1.0041 1.0024 1.0153 1.0165 1.0328 1.0200 1.0006 1.0106 1.0193 1.0088 0.9998 0.9994 0.9994
dispcorr: -0.035761893 hartree
energy: -11427.147772247135
dipole: -84.47758 84.89899 0.42141 -20.32178 20.92793 0.60615 -11.34989 12.50437 1.15448
magnitude: 1.37034 au
magnitude: 3.48312 debye
