program: Orca
programVersion: 5.0.2
elementType: Br Br Br Br O O O N C C C C C C C C C C C C C C C C C C C C C C H H H H H H H H H H H H H H H H H H H
charge: 0
multiplicity: 1
keywords: wb97x-d3
keywords: def2-TZVPP
keywords: def2/J RIJCOSX
keywords: DEFGRID2
keywords: scfconv7
keywords: smallprint printgap noloewdin
keywords: NOSOSCF
formula: C22H19Br4NO3
InChI: InChI=1/C22H19Br4NO3/c1-21(2)17(19(23)22(24,25)26)18(21)20(28)30-16(12-27)13-7-6-10-15(11-13)29-14-8-4-3-5-9-14/h3-11,16-19H,1-2H3
49 atoms
Br 3.673865 -1.260846 -0.885017
Br 1.136133 1.05719 -0.664107
Br 0.159576 -0.288717 1.987703
Br 3.087848 0.813767 1.797902
O  -1.713473 -2.775372 -0.765222
O  -1.914451 -3.370466 1.382247
O  -1.851815 2.310926 -1.496594
N  -3.914748 -2.602576 -3.229796
C  1.201905 -3.732873 -0.620181
C  1.090767 -2.266894 -0.351517
C  0.253606 -3.237816 0.45274
C  2.152499 -1.457694 0.331968
C  2.387368 -4.518822 -0.105112
C  0.707096 -4.242322 -1.953048
C  -1.221845 -3.159707 0.426849
C  1.682969 -0.069596 0.802611
C  -3.060259 -2.313333 -0.778295
C  -3.102974 -0.873362 -0.332194
C  -3.527447 -2.47902 -2.155685
C  -2.519669 0.103088 -1.128097
C  -3.648964 -0.540609 0.898387
C  -2.482533 1.416891 -0.690703
C  -3.608091 0.778748 1.325003
C  -3.024231 1.761341 0.543346
C  -2.273767 3.611444 -1.536494
C  -1.315616 4.605395 -1.415723
C  -3.607582 3.933307 -1.752488
C  -1.696878 5.934829 -1.520008
C  -3.976115 5.265964 -1.843837
C  -3.025729 6.27069 -1.729057
H  0.551869 -1.721781 -1.119235
H  0.59611 -3.436611 1.462147
H  2.537758 -1.978987 1.211841
H  3.219177 -4.465938 -0.807283
H  2.749995 -4.172581 0.862916
H  2.11383 -5.568275 0.011768
H  -0.092034 -3.64032 -2.375868
H  1.532104 -4.241767 -2.666671
H  0.345726 -5.268019 -1.865373
H  -3.689491 -2.931024 -0.130848
H  -2.09314 -0.142298 -2.093561
H  -4.088517 -1.304904 1.525011
H  -4.026583 1.045799 2.286007
H  -2.986893 2.784499 0.893385
H  -0.281379 4.335112 -1.246969
H  -4.349211 3.151537 -1.857438
H  -0.948368 6.710794 -1.430385
H  -5.014045 5.518384 -2.015519
H  -3.31951 7.308572 -1.806362
nucrepener: 5983.42003909 hartree
xcener: -389.817178493847 hartree
chargesum: -0.0000000
charge: -0.060270 -0.012150 -0.008921 0.001868 -0.269004 -0.341094 -0.302535 0.001951 0.095618 -0.106195 -0.101625 -0.181205 -0.249572 -0.240049 0.298444 0.077285 0.324351 0.081411 -0.278066 -0.259028 -0.138166 0.189961 -0.121775 -0.128313 0.219425 -0.187200 -0.141054 -0.106670 -0.123750 -0.131950 0.111258 0.101545 0.149016 0.100400 0.075323 0.104588 0.094086 0.093466 0.094668 0.123480 0.122356 0.118854 0.131393 0.136100 0.123456 0.134507 0.127921 0.128446 0.127414
qa: -0.0603 -0.0122 -0.0089 0.0019 -0.2690 -0.3411 -0.3025 0.0020 0.0956 -0.1062 -0.1016 -0.1812 -0.2496 -0.2400 0.2984 0.0773 0.3244 0.0814 -0.2781 -0.2590 -0.1382 0.1900 -0.1218 -0.1283 0.2194 -0.1872 -0.1411 -0.1067 -0.1237 -0.1320 0.1113 0.1015 0.1490 0.1004 0.0753 0.1046 0.0941 0.0935 0.0947 0.1235 0.1224 0.1189 0.1314 0.1361 0.1235 0.1345 0.1279 0.1284 0.1274
va: 1.2029 1.2356 1.2357 1.2376 2.0965 2.1577 2.0607 3.1127 3.8667 3.7012 3.8633 4.1275 3.9140 3.9060 4.2744 4.2846 3.8293 3.5673 4.0273 4.0488 3.9733 3.8140 3.9604 3.9379 3.8236 4.0201 3.9566 3.9614 3.9568 3.9499 1.0422 1.0255 1.0010 1.0082 1.0080 1.0046 1.0170 1.0038 1.0029 1.0179 1.0313 1.0192 1.0006 1.0042 1.0104 1.0041 0.9999 0.9997 0.9998
dispcorr: -0.035048540 hartree
energy: -11427.145944861859
dipole: -88.42260 88.72772 0.30512 -11.23443 11.67055 0.43612 -32.70552 33.62038 0.91485
magnitude: 1.05842 au
magnitude: 2.69029 debye
