program: Orca
programVersion: 5.0.2
elementType: Br Br Br Br O O O N C C C C C C C C C C C C C C C C C C C C C C H H H H H H H H H H H H H H H H H H H
charge: 0
multiplicity: 1
keywords: wb97x-d3
keywords: def2-TZVPP
keywords: def2/J RIJCOSX
keywords: DEFGRID2
keywords: scfconv7
keywords: smallprint printgap noloewdin
keywords: NOSOSCF
formula: C22H19Br4NO3
InChI: InChI=1/C22H19Br4NO3/c1-21(2)17(19(23)22(24,25)26)18(21)20(28)30-16(12-27)13-7-6-10-15(11-13)29-14-8-4-3-5-9-14/h3-11,16-19H,1-2H3
49 atoms
Br 4.070127 -1.815027 -0.618334
Br 3.041519 -0.828071 2.533972
Br 0.345175 -2.372115 2.098761
Br 3.059177 -3.912375 1.893001
O  -2.156437 -0.33074 -0.231434
O  -0.660317 1.294823 0.13188
O  -3.726273 4.929088 -1.603144
N  -5.018311 -1.117923 1.203793
C  1.097194 -0.429191 -1.838705
C  1.483634 -0.702153 -0.420508
C  0.031661 -0.79074 -0.82171
C  2.216477 -1.942641 -0.000266
C  1.337293 -1.460627 -2.917125
C  1.24081 0.986632 -2.342117
C  -0.918894 0.191435 -0.261671
C  2.192255 -2.224882 1.511897
C  -3.192656 0.504201 0.274334
C  -3.74751 1.405992 -0.799817
C  -4.212453 -0.412541 0.789273
C  -3.517293 2.769892 -0.728748
C  -4.46223 0.867299 -1.863862
C  -4.01306 3.60646 -1.721266
C  -4.941806 1.708925 -2.851481
C  -4.723312 3.077335 -2.791083
C  -4.584913 5.852443 -2.135274
C  -4.066848 6.80395 -2.998876
C  -5.928693 5.869682 -1.783914
C  -4.903165 7.78495 -3.511917
C  -6.755011 6.848819 -2.310768
C  -6.248118 7.807928 -3.176709
H  1.74335 0.186732 0.146046
H  -0.382444 -1.78555 -0.939882
H  1.80145 -2.826845 -0.490617
H  2.34632 -1.371352 -3.319405
H  1.207219 -2.487068 -2.573968
H  0.635329 -1.306332 -3.737677
H  2.243181 1.125104 -2.749736
H  0.525694 1.185236 -3.141845
H  1.090028 1.732388 -1.566124
H  -2.826094 1.10439 1.112885
H  -2.946802 3.193712 0.087845
H  -4.653428 -0.196885 -1.916816
H  -5.497158 1.299227 -3.684377
H  -5.105146 3.72123 -3.572325
H  -3.016541 6.776575 -3.25741
H  -6.324125 5.12805 -1.101488
H  -4.49856 8.531083 -4.182782
H  -7.801319 6.86443 -2.035928
H  -6.897432 8.571837 -3.58228
nucrepener: 5419.32648875 hartree
twoeener: 9822.95288326 hartree
xcener: -389.811948227380 hartree
chargesum: 0.0000000
charge: -0.059014 0.000162 -0.003524 0.008146 -0.255216 -0.376587 -0.294645 -0.001214 0.078213 -0.073867 -0.172227 -0.178333 -0.243222 -0.246876 0.377389 0.035082 0.313200 -0.001288 -0.257195 -0.138758 -0.170133 0.182436 -0.124401 -0.133377 0.209247 -0.187940 -0.144657 -0.102626 -0.120554 -0.132243 0.121999 0.101373 0.147562 0.100217 0.075372 0.102875 0.094934 0.091420 0.102104 0.120927 0.117905 0.123252 0.131042 0.134649 0.127546 0.135309 0.127557 0.129760 0.128216
qa: -0.0590 0.0002 -0.0035 0.0081 -0.2552 -0.3766 -0.2946 -0.0012 0.0782 -0.0739 -0.1722 -0.1783 -0.2432 -0.2469 0.3774 0.0351 0.3132 -0.0013 -0.2572 -0.1388 -0.1701 0.1824 -0.1244 -0.1334 0.2092 -0.1879 -0.1447 -0.1026 -0.1206 -0.1322 0.1220 0.1014 0.1476 0.1002 0.0754 0.1029 0.0949 0.0914 0.1021 0.1209 0.1179 0.1233 0.1310 0.1346 0.1275 0.1353 0.1276 0.1298 0.1282
va: 1.2039 1.2336 1.2402 1.2411 2.1257 2.1301 2.1071 3.1191 3.8767 3.7018 3.9376 4.1180 3.9029 3.9069 4.1765 4.3535 3.8385 3.6733 4.0203 4.0281 4.0314 3.9239 3.9710 3.9246 3.8285 4.0292 3.9537 3.9379 3.9461 3.9509 1.0445 1.0293 1.0036 1.0087 1.0084 1.0053 1.0031 1.0018 1.0213 1.0187 1.0317 1.0158 1.0011 1.0041 1.0121 1.0022 0.9989 0.9995 0.9997
dispcorr: -0.028644191 hartree
energy: -11427.143233809251
dipole: -135.29851 135.24645 -0.05207 119.49082 -118.59483 0.89599 -92.05850 90.31253 -1.74596
magnitude: 1.96313 au
magnitude: 4.98989 debye
