program: Orca
programVersion: 5.0.2
elementType: O O O O N C C C C C C C C C C C C C C C C C C C H H H H H H H H H H H H H H H H H H H H H H H H H
charge: 0
multiplicity: 1
keywords: wb97x-d3
keywords: def2-TZVPP
keywords: def2/J RIJCOSX
keywords: DEFGRID2
keywords: scfconv7
keywords: smallprint printgap noloewdin
keywords: NOSOSCF
formula: C19H25NO4
InChI: InChI=1/C19H25NO4/c1-11(2)9-14-15(19(14,3)4)18(23)24-10-20-16(21)12-7-5-6-8-13(12)17(20)22/h9,14-15H,5-8,10H2,1-4H3
49 atoms
O  1.132058 -1.749707 -1.011491
O  1.817739 -1.535929 1.112362
O  -1.623962 -1.435674 -2.759399
O  -1.152523 -1.190945 1.754991
N  -1.157075 -1.652606 -0.511763
C  4.16271 0.170434 0.011812
C  3.003422 1.10008 0.074852
C  2.860931 -0.263706 -0.63037
C  5.251334 0.507244 -0.981737
C  4.700093 -0.495593 1.254454
C  2.26714 1.399808 1.324548
C  1.928616 -1.235067 -0.05118
C  1.011115 1.854524 1.343006
C  -0.010377 -2.499255 -0.626648
C  0.311668 2.182723 2.624402
C  0.223625 2.067694 0.080785
C  -2.803616 -0.142049 -1.089382
C  -2.665656 -0.075964 0.235028
C  -3.756741 0.66314 -1.889914
C  -3.458653 0.797685 1.132442
C  -4.289177 1.813998 -1.034644
C  -4.664519 1.352065 0.372275
C  -1.82792 -1.125365 -1.612124
C  -1.586022 -1.006489 0.645173
H  3.0184 1.913416 -0.646417
H  2.834848 -0.217614 -1.7124
H  4.852415 0.990973 -1.873979
H  5.98019 1.185006 -0.533967
H  5.783528 -0.391798 -1.297864
H  5.141079 -1.463193 1.009289
H  5.49202 0.124695 1.678472
H  3.961232 -0.655723 2.03393
H  2.789427 1.261834 2.265991
H  0.138926 -3.035748 0.307496
H  -0.179069 -3.223253 -1.418682
H  0.948286 2.023009 3.494453
H  -0.022748 3.223349 2.633686
H  -0.586354 1.570592 2.742943
H  -0.830201 2.248313 0.292437
H  0.590273 2.935627 -0.473748
H  0.286254 1.21442 -0.597829
H  -3.27095 1.0385 -2.793327
H  -4.575656 0.022041 -2.230789
H  -3.774893 0.246862 2.02103
H  -2.819831 1.61099 1.493514
H  -3.524236 2.59271 -0.967004
H  -5.153088 2.263811 -1.524612
H  -5.433904 0.578138 0.305703
H  -5.099723 2.178704 0.934522
elementType: O N C H
totalener: -1094.86566906 hartree
nucrepener: 2224.89823077 hartree
electener: -3319.76389983 hartree
oneelecener: -5912.43137922 hartree
twoeener: 2592.66747939 hartree
cpcmener: -0.04449084 hartree
kineticenergy: 1090.04377008 hartree
xcener: -105.976295177162 hartree
chargesum: 0.0000000
charge: -0.291480 -0.472643 -0.434887 -0.428340 -0.086592 0.130878 -0.019280 -0.098725 -0.265969 -0.293942 -0.277998 0.396388 -0.010258 0.070620 -0.221318 -0.279280 -0.046234 -0.086663 -0.068604 -0.082144 -0.140560 -0.128113 0.338973 0.309904 0.116407 0.094382 0.088588 0.095760 0.096771 0.103602 0.099462 0.090302 0.125826 0.132082 0.136585 0.092817 0.105687 0.079140 0.094197 0.124766 0.087634 0.092409 0.101995 0.103952 0.102084 0.078192 0.082226 0.080181 0.081219
qa: -0.2915 -0.4726 -0.4349 -0.4283 -0.0866 0.1309 -0.0193 -0.0987 -0.2660 -0.2939 -0.2780 0.3964 -0.0103 0.0706 -0.2213 -0.2793 -0.0462 -0.0867 -0.0686 -0.0821 -0.1406 -0.1281 0.3390 0.3099 0.1164 0.0944 0.0886 0.0958 0.0968 0.1036 0.0995 0.0903 0.1258 0.1321 0.1366 0.0928 0.1057 0.0791 0.0942 0.1248 0.0876 0.0924 0.1020 0.1040 0.1021 0.0782 0.0822 0.0802 0.0812
va: 2.0988 2.0155 2.0739 2.0674 3.1071 3.7745 3.8002 3.8296 3.8972 3.8881 3.8144 4.0982 3.6676 3.9154 3.9122 3.9634 3.6532 3.6388 3.9179 3.9140 3.9166 3.9134 4.1699 4.1536 1.0033 1.0327 1.0041 1.0023 1.0021 0.9995 0.9988 1.0171 1.0014 1.0170 1.0040 1.0104 0.9927 1.0030 1.0046 0.9991 0.9992 1.0167 1.0040 1.0167 1.0054 1.0089 1.0101 1.0070 1.0099
dispcorr: -0.028806893 hartree
energy: -1094.894475954218
dipole: 6.06197 -7.26782 -1.20585 19.77318 -18.08287 1.69030 4.96723 -5.82433 -0.85710
magnitude: 2.24629 au
magnitude: 5.70961 debye
