program: Orca
programVersion: 5.0.2
elementType: O O O O N C C C C C C C C C C C C C C C C C C C H H H H H H H H H H H H H H H H H H H H H H H H H
charge: 0
multiplicity: 1
keywords: wb97x-d3
keywords: def2-TZVPP
keywords: def2/J RIJCOSX
keywords: DEFGRID2
keywords: scfconv7
keywords: smallprint printgap noloewdin
keywords: NOSOSCF
formula: C19H25NO4
InChI: InChI=1/C19H25NO4/c1-11(2)9-14-15(19(14,3)4)18(23)24-10-20-16(21)12-7-5-6-8-13(12)17(20)22/h9,14-15H,5-8,10H2,1-4H3
49 atoms
O  1.209892 -1.81848 -1.082904
O  1.298135 -1.260695 1.079007
O  -1.14939 -0.611158 -2.686794
O  -1.586881 -2.119736 1.580448
N  -1.103331 -1.652101 -0.632255
C  4.073281 -0.035807 0.495794
C  3.108098 1.006878 0.055925
C  2.955707 -0.439671 -0.446616
C  5.439367 -0.012601 -0.151064
C  4.123743 -0.512815 1.926368
C  2.096315 1.611652 0.955672
C  1.771509 -1.196532 -0.030424
C  0.999673 2.246995 0.53306
C  0.000509 -2.530117 -0.871759
C  0.027893 2.853202 1.49704
C  0.638324 2.396092 -0.911347
C  -2.559006 0.122854 -0.857349
C  -2.672074 -0.314531 0.397287
C  -3.329114 1.247377 -1.441786
C  -3.579192 0.255442 1.42218
C  -4.50069 1.595171 -0.522088
C  -4.08667 1.618391 0.948254
C  -1.542699 -0.705513 -1.550266
C  -1.747341 -1.458677 0.586114
H  3.467269 1.663856 -0.731031
H  3.245666 -0.601328 -1.477799
H  5.39268 0.311107 -1.191489
H  6.101429 0.672667 0.381293
H  5.897216 -1.003048 -0.128862
H  4.846238 0.091057 2.478352
H  3.178053 -0.451839 2.455568
H  4.464288 -1.548491 1.970883
H  2.270988 1.542162 2.024702
H  0.078896 -3.232655 -0.04319
H  -0.159124 -3.09128 -1.788556
H  -0.970363 2.427546 1.360119
H  0.322916 2.695943 2.534072
H  -0.071495 3.928784 1.331549
H  0.547081 3.45135 -1.178679
H  1.356102 1.939979 -1.589121
H  -0.338061 1.950039 -1.109843
H  -2.664607 2.108776 -1.56556
H  -3.680711 0.990718 -2.443467
H  -4.413779 -0.433187 1.587661
H  -3.063279 0.341975 2.38108
H  -4.913666 2.562577 -0.80909
H  -5.2977 0.859778 -0.661803
H  -4.927275 1.930517 1.568847
H  -3.297954 2.362946 1.089823
elementType: O N C H
totalener: -1094.86675903 hartree
nucrepener: 2234.29477947 hartree
electener: -3329.16153850 hartree
oneelecener: -5931.35969242 hartree
twoeener: 2602.19815392 hartree
cpcmener: -0.04280756 hartree
kineticenergy: 1090.05938163 hartree
xcener: -105.980247974264 hartree
chargesum: -0.0000000
charge: -0.290733 -0.483489 -0.434460 -0.428952 -0.094410 0.139544 -0.020695 -0.116092 -0.264191 -0.296106 -0.268756 0.422916 -0.018731 0.081372 -0.206215 -0.254796 -0.101855 -0.047331 -0.069054 -0.078465 -0.128562 -0.154311 0.321746 0.328012 0.113270 0.094427 0.088219 0.095922 0.095875 0.099098 0.090562 0.102752 0.128041 0.132765 0.145058 0.065278 0.093038 0.099988 0.113428 0.096858 0.064040 0.107265 0.096691 0.108867 0.097084 0.081180 0.079195 0.087011 0.087703
qa: -0.2907 -0.4835 -0.4345 -0.4290 -0.0944 0.1395 -0.0207 -0.1161 -0.2642 -0.2961 -0.2688 0.4229 -0.0187 0.0814 -0.2062 -0.2548 -0.1019 -0.0473 -0.0691 -0.0785 -0.1286 -0.1543 0.3217 0.3280 0.1133 0.0944 0.0882 0.0959 0.0959 0.0991 0.0906 0.1028 0.1280 0.1328 0.1451 0.0653 0.0930 0.1000 0.1134 0.0969 0.0640 0.1073 0.0967 0.1089 0.0971 0.0812 0.0792 0.0870 0.0877
va: 2.1060 2.0068 2.0681 2.0793 3.0775 3.7560 3.8017 3.8453 3.8980 3.8905 3.8373 4.0734 3.6868 3.9020 3.9253 3.9442 3.6649 3.6046 3.9068 3.9005 3.9073 3.9213 4.1572 4.1916 1.0044 1.0305 1.0041 1.0019 1.0025 0.9991 1.0184 0.9996 1.0011 1.0154 0.9948 1.0004 1.0098 0.9984 1.0008 1.0101 1.0101 1.0034 1.0161 1.0039 1.0147 1.0099 1.0070 1.0102 1.0012
dispcorr: -0.028338110 hartree
energy: -1094.895097143146
dipole: 6.69641 -7.37884 -0.68243 20.14663 -18.69351 1.45313 5.72046 -6.35516 -0.63470
magnitude: 1.72631 au
magnitude: 4.38792 debye
