program: Orca
programVersion: 5.0.2
elementType: O O O O N C C C C C C C C C C C C C C C C C C C H H H H H H H H H H H H H H H H H H H H H H H H H
charge: 0
multiplicity: 1
keywords: wb97x-d3
keywords: def2-TZVPP
keywords: def2/J RIJCOSX
keywords: DEFGRID2
keywords: scfconv7
keywords: smallprint printgap noloewdin
keywords: NOSOSCF
formula: C19H25NO4
InChI: InChI=1/C19H25NO4/c1-11(2)9-14-15(19(14,3)4)18(23)24-10-20-16(21)12-7-5-6-8-13(12)17(20)22/h9,14-15H,5-8,10H2,1-4H3
49 atoms
O  1.037831 -1.601988 -1.139252
O  0.692433 0.594821 -0.920855
O  -2.142238 0.401266 -2.163156
O  -1.028945 -2.968306 0.679787
N  -1.319195 -1.42122 -1.002551
C  2.745398 0.05672 1.458129
C  3.454548 0.807629 0.382979
C  2.653107 -0.431225 0.017389
C  3.568411 -0.80986 2.379061
C  1.533949 0.654267 2.129101
C  3.075535 2.193417 0.00612
C  1.381025 -0.37369 -0.718654
C  3.171363 2.72495 -1.213765
C  -0.197646 -1.767724 -1.817451
C  2.805462 4.155391 -1.467647
C  3.608238 1.951846 -2.419215
C  -3.00458 -0.219472 0.006503
C  -2.694304 -1.217788 0.834088
C  -4.043228 0.808311 0.257565
C  -3.348921 -1.480521 2.138615
C  -4.453715 0.765749 1.730642
C  -4.641053 -0.665651 2.232731
C  -2.137707 -0.311446 -1.194264
C  -1.59651 -2.008198 0.224417
H  4.523447 0.611966 0.330606
H  3.235954 -1.320514 -0.194268
H  2.980567 -1.645015 2.76506
H  4.44346 -1.222815 1.875369
H  3.922349 -0.230066 3.234423
H  0.860112 -0.132471 2.475177
H  1.842128 1.226353 3.006364
H  0.961065 1.323398 1.491652
H  2.732797 2.831827 0.816073
H  -0.229245 -2.822202 -2.081084
H  -0.237535 -1.1759 -2.732144
H  2.492211 4.668057 -0.55787
H  3.645109 4.710279 -1.894644
H  1.988547 4.227011 -2.191144
H  4.460335 2.436031 -2.904478
H  3.894072 0.925938 -2.192578
H  2.809096 1.919798 -3.165401
H  -3.671299 1.798582 -0.016422
H  -4.904257 0.620058 -0.39214
H  -3.550393 -2.547903 2.257121
H  -2.660721 -1.212836 2.947222
H  -3.685582 1.261807 2.331156
H  -5.374224 1.334562 1.870096
H  -5.419056 -1.157325 1.641512
H  -4.992738 -0.656858 3.265362
elementType: O N C H
totalener: -1094.87435859 hartree
nucrepener: 2179.52475592 hartree
electener: -3274.39911451 hartree
oneelecener: -5822.13762513 hartree
twoeener: 2547.73851062 hartree
cpcmener: -0.03280382 hartree
kineticenergy: 1090.05281800 hartree
xcener: -105.974140739672 hartree
chargesum: -0.0000000
charge: -0.282655 -0.452824 -0.401817 -0.412156 -0.104848 0.142177 -0.021203 -0.127197 -0.264832 -0.304506 -0.257061 0.397614 -0.027263 0.086087 -0.225486 -0.268347 -0.048005 -0.085787 -0.076573 -0.072486 -0.135910 -0.137311 0.304984 0.311723 0.115451 0.097367 0.096100 0.086179 0.093755 0.098806 0.103721 0.097688 0.120397 0.141386 0.132803 0.088154 0.094321 0.094304 0.104757 0.093454 0.098777 0.093890 0.100185 0.093479 0.100691 0.078874 0.080887 0.078126 0.080130
qa: -0.2827 -0.4528 -0.4018 -0.4122 -0.1048 0.1422 -0.0212 -0.1272 -0.2648 -0.3045 -0.2571 0.3976 -0.0273 0.0861 -0.2255 -0.2683 -0.0480 -0.0858 -0.0766 -0.0725 -0.1359 -0.1373 0.3050 0.3117 0.1155 0.0974 0.0961 0.0862 0.0938 0.0988 0.1037 0.0977 0.1204 0.1414 0.1328 0.0882 0.0943 0.0943 0.1048 0.0935 0.0988 0.0939 0.1002 0.0935 0.1007 0.0789 0.0809 0.0781 0.0801
va: 2.1106 2.0381 2.1146 2.1030 3.0687 3.7318 3.8466 3.8144 3.9009 3.9090 3.8531 4.1056 3.7075 3.8992 3.9264 3.9466 3.6341 3.6882 3.9161 3.9189 3.9143 3.9161 4.2140 4.2096 1.0032 1.0299 1.0021 1.0050 1.0019 1.0038 0.9997 1.0116 0.9996 0.9916 1.0143 1.0073 0.9968 0.9963 1.0002 1.0037 0.9985 1.0158 1.0046 1.0156 1.0054 1.0067 1.0092 1.0060 1.0095
dispcorr: -0.025316154 hartree
energy: -1094.899674744612
dipole: 10.04061 -10.43620 -0.39559 14.95936 -15.07329 -0.11393 11.11539 -10.02697 1.08842
magnitude: 1.16367 au
magnitude: 2.95782 debye
