program: Orca
programVersion: 5.0.2
elementType: O O O O N C C C C C C C C C C C C C C C C C C C H H H H H H H H H H H H H H H H H H H H H H H H H
charge: 0
multiplicity: 1
keywords: wb97x-d3
keywords: def2-TZVPP
keywords: def2/J RIJCOSX
keywords: DEFGRID2
keywords: scfconv7
keywords: smallprint printgap noloewdin
keywords: NOSOSCF
formula: C19H25NO4
InChI: InChI=1/C19H25NO4/c1-11(2)9-14-15(19(14,3)4)18(23)24-10-20-16(21)12-7-5-6-8-13(12)17(20)22/h9,14-15H,5-8,10H2,1-4H3
49 atoms
O  1.09914 -1.655818 -0.978842
O  1.926571 -1.556448 1.102522
O  -1.803502 -1.656145 -2.728222
O  -1.116662 -0.902362 1.702566
N  -1.188437 -1.575684 -0.506968
C  4.2336 0.147459 -0.068887
C  3.103128 1.102856 0.089205
C  2.886401 -0.230808 -0.648533
C  5.277602 0.494442 -1.105951
C  4.818131 -0.570358 1.122722
C  2.453406 1.382544 1.391343
C  1.964428 -1.204775 -0.048579
C  1.222084 1.886435 1.51119
C  -0.030861 -2.40996 -0.568563
C  0.631759 2.210419 2.848337
C  0.35471 2.176399 0.319484
C  -2.949057 -0.23012 -1.144071
C  -2.744733 -0.01002 0.155148
C  -3.996598 0.422188 -1.966765
C  -3.541779 0.911243 1.000857
C  -4.573743 1.616204 -1.204222
C  -4.829584 1.288191 0.266435
C  -1.951313 -1.221185 -1.615319
C  -1.602012 -0.843767 0.602565
H  3.104518 1.941548 -0.602566
H  2.799178 -0.147412 -1.725426
H  4.847871 1.018286 -1.961045
H  6.04482 1.141011 -0.675234
H  5.772752 -0.403665 -1.4804
H  5.245809 -1.52821 0.820782
H  5.628194 0.029146 1.543003
H  4.107756 -0.764277 1.920265
H  3.031033 1.19726 2.291428
H  0.123128 -2.891759 0.394572
H  -0.185542 -3.176668 -1.323874
H  1.325892 2.012358 3.665036
H  0.335252 3.26163 2.904063
H  -0.274162 1.62496 3.025695
H  0.457726 1.429411 -0.46756
H  -0.697906 2.226726 0.59713
H  0.60413 3.143135 -0.125234
H  -3.585026 0.734697 -2.929573
H  -4.77953 -0.307612 -2.197567
H  -3.7610 0.45039 1.966967
H  -2.945279 1.802835 1.222354
H  -3.876404 2.456307 -1.271826
H  -5.499414 1.940337 -1.68196
H  -5.536957 0.456543 0.333073
H  -5.299426 2.13817 0.763422
elementType: O N C H
totalener: -1094.87506384 hartree
nucrepener: 2200.71917743 hartree
electener: -3295.59424127 hartree
oneelecener: -5864.05368330 hartree
twoeener: 2568.45944203 hartree
cpcmener: -0.03477310 hartree
kineticenergy: 1090.04121689 hartree
xcener: -105.972021329437 hartree
chargesum: -0.0000000
charge: -0.285631 -0.441556 -0.409260 -0.399677 -0.075390 0.135422 -0.024598 -0.101604 -0.263622 -0.296092 -0.263042 0.375210 -0.019644 0.073051 -0.209606 -0.284425 -0.051277 -0.081295 -0.071733 -0.070161 -0.134485 -0.135570 0.315320 0.272886 0.112461 0.093555 0.086149 0.094752 0.095976 0.100539 0.098047 0.094057 0.120924 0.131834 0.130917 0.088396 0.100337 0.081773 0.091786 0.088983 0.124431 0.093199 0.100500 0.098280 0.101039 0.077041 0.081158 0.079547 0.081095
qa: -0.2856 -0.4416 -0.4093 -0.3997 -0.0754 0.1354 -0.0246 -0.1016 -0.2636 -0.2961 -0.2630 0.3752 -0.0196 0.0731 -0.2096 -0.2844 -0.0513 -0.0813 -0.0717 -0.0702 -0.1345 -0.1356 0.3153 0.2729 0.1125 0.0936 0.0861 0.0948 0.0960 0.1005 0.0980 0.0941 0.1209 0.1318 0.1309 0.0884 0.1003 0.0818 0.0918 0.0890 0.1244 0.0932 0.1005 0.0983 0.1010 0.0770 0.0812 0.0795 0.0811
va: 2.1008 2.0512 2.1073 2.1015 3.0907 3.7683 3.8105 3.8263 3.8968 3.8911 3.8299 4.1320 3.6974 3.9053 3.9110 3.9533 3.6544 3.6238 3.9254 3.9113 3.9117 3.9170 4.2167 4.1916 1.0031 1.0320 1.0043 1.0024 1.0024 1.0002 0.9987 1.0176 1.0029 1.0194 1.0061 1.0095 0.9943 1.0050 1.0016 1.0092 0.9984 1.0159 1.0042 1.0165 1.0056 1.0081 1.0092 1.0069 1.0096
dispcorr: -0.027571486 hartree
energy: -1094.902635327817
dipole: 6.49365 -7.74201 -1.24837 19.27476 -17.72205 1.55271 5.05174 -5.83189 -0.78015
magnitude: 2.13961 au
magnitude: 5.43846 debye
