program: Gaussian 09
title: 000068134
version: EM64L-G09RevD.01
frameworkgroup: C1[X(C7H14N2O4S2)]
method: RPBEPBE
basis: SDD
operation: Freq
keyword: #p
keyword: freq=noraman
keyword: PBEPBE/SDD
title: #p freq=noraman PBEPBE/SDD
converged: YES YES NO NO
title: Mulliken charges:
elementType: S S O O O O N N C C C C C C C H H H H H H H H H H H H H H
charge: 0.179584 0.178918 -0.430751 -0.430965 -0.231941 -0.231975 -0.622699 -0.622801 -0.095383 -0.095080 -0.686825 -0.686591 -0.914170 0.232071 0.231457 0.247379 0.247509 0.254754 0.295133 0.254770 0.294868 0.350656 0.351110 0.304289 0.278902 0.304613 0.278629 0.382164 0.382376
chargesum: 0.00000
title: Mulliken charges with hydrogens summed into heavy atoms:
elementType: S S O O O O N N C C C C C C C
charge: 0.179584 0.178918 -0.048587 -0.048589 -0.231941 -0.231975 -0.039508 -0.039559 0.151996 0.152430 -0.136939 -0.136954 -0.212403 0.232071 0.231457
polarizability: 1.92616777e+02 1.39920705e-01 1.20450421e+02 5.37988772e+00 3.43563480e-03 1.03877868e+02
1716.lowfreq: -3.4856 -2.1920 -0.0011 0.0014 0.0018 6.4091 19.1005 24.0078 29.4654
frequency: 19.0255 23.9158 29.4201 41.6237 46.7866 60.6305 74.6862 129.1018 147.4855 161.8029 185.5048 239.0556 242.9057 252.8758 266.3035 276.3276 285.4694 308.3561 330.5822 373.4070 374.3894 470.3650 471.6864 534.6253 535.9444 577.6332 579.1499 603.9591 629.3431 630.6796 645.1734 682.8803 684.5170 731.7301 735.2680 760.4550 762.8168 849.4167 916.0636 927.5008 998.7294 999.7563 1046.0449 1048.9139 1092.1390 1093.2451 1152.9546 1157.5887 1198.2334 1209.1520 1213.0035 1237.0770 1247.8291 1258.0100 1263.0799 1265.3404 1298.2379 1299.7426 1386.2599 1388.8617 1398.0304 1432.9728 1434.6075 1628.0590 1628.2364 1677.1431 1678.7061 2878.8814 2880.4027 3029.2403 3029.9309 3059.6363 3105.3675 3105.7199 3159.4761 3465.8419 3466.4931 3515.7738 3516.2991 3599.0428 3599.8529
redmass: 5.7400 7.5400 5.4445 5.9841 9.9606 9.6233 9.2748 5.9447 7.0385 4.2273 3.5140 1.4622 1.2053 2.3524 3.6340 3.3738 3.0166 1.9989 5.0956 4.4215 4.6853 4.0045 4.0780 3.7722 3.7870 1.3249 1.3286 6.7242 1.4003 1.4097 7.1921 3.8266 3.8892 4.1058 4.3896 2.5607 2.6852 1.6079 1.9444 1.9438 3.4668 3.5134 2.2727 2.2521 2.3531 2.4169 1.1369 1.1349 1.1678 1.3942 1.2334 1.1377 1.1504 1.3169 1.6795 1.3970 1.3925 1.3685 1.6377 1.9109 1.1777 1.0941 1.0926 1.0940 1.0938 9.2167 9.0574 1.0801 1.0802 1.0589 1.0591 1.0537 1.1059 1.1059 1.1122 1.0446 1.0446 1.0641 1.0641 1.0987 1.0987
irintensity: 0.6630 2.5388 3.9838 1.8751 0.2025 1.1471 0.0051 5.3247 0.0017 4.9085 8.7865 27.1178 46.2469 24.0685 10.0620 4.3684 4.8565 34.8386 0.3030 25.7599 0.4251 64.2453 36.6614 5.2397 14.4777 27.1158 22.8385 0.2887 520.9120 129.1131 69.2025 87.6441 32.7987 24.7889 5.7909 1.4016 0.4340 31.7777 0.2914 13.1117 13.4417 65.8788 547.2371 114.0900 6.2908 32.4764 5.2467 1.3890 0.0386 0.0987 0.2509 6.0776 3.0728 11.8428 9.9628 27.1670 3.2839 21.5199 0.0970 18.2993 13.0516 25.4295 5.4792 55.4106 52.1631 404.5960 38.2551 47.3683 45.0215 7.3173 31.0136 0.2105 2.2170 4.5459 30.5781 4.1021 3.9224 27.8263 27.7125 5.0195 5.0083
temp: 298.150 k
press: 1.00000 atm
elementType: 16 16 8 8 8 8 7 7 6 6 6 6 6 6 6 1 1 1 1 1 1 1 1 1 1 1 1 1 1
symmnumber: 1
zpe: 578650.3 jmol-1
zpe.correction: 0.220396 hartree
zpe.thermalcorrener: 0.239039 hartree
zpe.thermalcorrenthalpy: 0.239983 hartree
zpe.thermalcorrgfe: 0.170118 hartree
zpe.sumelectzpe: -1480.454595 hartree
zpe.sumelectthermal: -1480.435952 hartree
zpe.sumelectthermalent: -1480.435008 hartree
zpe.sumelectthermalfe: -1480.504873 hartree
dipole: 0.0167 0.8211 -0.0303
dipole: 0.8218
quadrupole: -69.2149 -92.3514 -112.6394
quadrupole: -0.0493 5.1772 -0.0573
quadrupole: 22.1870 -0.9495 -21.2375 -0.0493 5.1772 -0.0573
hfenergy: -1480.674991 hartree
pointgroup: C01 [X(C7H14N2O4S2)]
dipole: 0.0026916 0.3214776 0.0344198 debye
polarizability: 189.8869834|-0.3906348|120.3757523|-16.2191437|1.2508866|106.6823293 unknown
InChI: InChI=1S/C7H14N2O4S2/c8-4(6(10)11)1-14-3-15-2-5(9)7(12)13/h4-5,10,12H,1-3,8-9H2
charge 0 multiplicity 1
29 atoms
S  1.194927 -0.36846 1.044525
S  -1.201089 -0.163833 -1.051339
O  4.916126 -1.798826 -1.448532
O  -4.969635 -1.787235 1.266666
O  2.62027 -1.898381 -1.740778
O  -2.67697 -2.029105 1.491215
N  4.510712 0.932163 -1.123012
N  -4.458089 0.939652 1.306182
C  3.645706 -0.038209 -0.415317
C  -3.633391 0.043977 0.464414
C  2.239023 0.564327 -0.228656
C  -2.205032 0.613559 0.351188
C  -0.021046 -1.265083 -0.07918
C  3.611492 -1.316644 -1.257302
C  -3.647156 -1.340591 1.117724
H  4.035868 -0.340498 0.587532
H  -4.038196 -0.100559 -0.567535
H  2.332296 1.595414 0.152651
H  1.676474 0.593607 -1.176201
H  -2.261635 1.691215 0.121765
H  -1.637788 0.487293 1.28793
H  0.541967 -1.829277 -0.83564
H  -0.607508 -1.915775 0.584141
H  5.421688 0.55177 -1.396785
H  4.576649 1.840303 -0.654636
H  -5.380053 0.557227 1.537274
H  -4.495848 1.903617 0.962814
H  4.887732 -2.618677 -2.012435
H  -4.971295 -2.679971 1.70703
