program: Orca
programVersion: 5.0.2
elementType: O O O O N C C C C C C C C C C C C C C C C C C C H H H H H H H H H H H H H H H H H H H H H H H H H
charge: 0
multiplicity: 1
keywords: wb97x-d3
keywords: def2-TZVPP
keywords: def2/J RIJCOSX
keywords: DEFGRID2
keywords: scfconv7
keywords: smallprint printgap noloewdin
keywords: NOSOSCF
formula: C19H25NO4
InChI: InChI=1/C19H25NO4/c1-11(2)9-14-15(19(14,3)4)18(23)24-10-20-16(21)12-7-5-6-8-13(12)17(20)22/h9,14-15H,5-8,10H2,1-4H3
49 atoms
O  1.198026 -1.855863 -1.119294
O  1.227748 -1.24335 1.028956
O  -1.166585 -0.593078 -2.662937
O  -1.621781 -2.304673 1.525373
N  -1.109957 -1.712767 -0.651142
C  4.013169 -0.015872 0.454274
C  3.052715 1.024204 -0.003543
C  2.899439 -0.428089 -0.486817
C  5.384629 -0.01292 -0.181135
C  4.040638 -0.468793 1.893235
C  2.055679 1.663129 0.885829
C  1.721061 -1.198321 -0.070541
C  0.99678 2.335957 0.426949
C  -0.007145 -2.578434 -0.926437
C  0.041939 3.02497 1.349838
C  0.700267 2.435929 -1.043788
C  -2.543126 0.086483 -0.787755
C  -2.6813 -0.427301 0.434881
C  -3.264504 1.276455 -1.301186
C  -3.612941 0.074939 1.472866
C  -3.933192 2.008055 -0.135666
C  -4.611436 1.042457 0.835748
C  -1.547586 -0.727314 -1.527723
C  -1.764221 -1.586909 0.570945
H  3.410119 1.668283 -0.80353
H  3.195723 -0.60242 -1.51454
H  6.061797 0.643713 0.368831
H  5.818023 -1.015138 -0.178821
H  5.354722 0.334008 -1.214986
H  4.732819 0.16034 2.456453
H  3.078368 -0.424927 2.394205
H  4.402353 -1.496301 1.964818
H  2.21881 1.606564 1.957242
H  0.07792 -3.307032 -0.120283
H  -0.166709 -3.10916 -1.862055
H  0.32342 2.912516 2.396891
H  -0.013448 4.094128 1.12716
H  -0.972659 2.635092 1.22868
H  1.524004 2.896176 -1.595231
H  0.539623 1.45321 -1.492552
H  -0.190415 3.034441 -1.235944
H  -2.571895 1.937269 -1.829083
H  -4.006146 0.964092 -2.043482
H  -4.130033 -0.759643 1.952817
H  -3.040671 0.568381 2.26517
H  -3.17936 2.591212 0.401757
H  -4.661627 2.722062 -0.52244
H  -5.37497 0.469412 0.301741
H  -5.129327 1.600216 1.617059
elementType: O N C H
totalener: -1094.87444925 hartree
nucrepener: 2233.00620526 hartree
electener: -3327.88065451 hartree
oneelecener: -5928.67340836 hartree
twoeener: 2600.79275385 hartree
cpcmener: -0.03360227 hartree
kineticenergy: 1090.04909316 hartree
xcener: -105.973992186084 hartree
chargesum: -0.0000000
charge: -0.286314 -0.455316 -0.408285 -0.400898 -0.093987 0.131963 -0.038191 -0.098524 -0.261874 -0.294129 -0.244289 0.391373 -0.015148 0.088838 -0.208130 -0.302964 -0.078888 -0.048695 -0.079955 -0.079385 -0.154556 -0.126987 0.281407 0.311216 0.113446 0.091736 0.094244 0.095960 0.085787 0.098616 0.093315 0.100361 0.123890 0.130434 0.139941 0.090317 0.101163 0.072544 0.114691 0.093187 0.100031 0.094804 0.108196 0.096774 0.101673 0.086509 0.085166 0.077964 0.080970
qa: -0.2863 -0.4553 -0.4083 -0.4009 -0.0940 0.1320 -0.0382 -0.0985 -0.2619 -0.2941 -0.2443 0.3914 -0.0151 0.0888 -0.2081 -0.3030 -0.0789 -0.0487 -0.0800 -0.0794 -0.1546 -0.1270 0.2814 0.3112 0.1134 0.0917 0.0942 0.0960 0.0858 0.0986 0.0933 0.1004 0.1239 0.1304 0.1399 0.0903 0.1012 0.0725 0.1147 0.0932 0.1000 0.0948 0.1082 0.0968 0.1017 0.0865 0.0852 0.0780 0.0810
va: 2.1080 2.0369 2.1002 2.1154 3.0672 3.7752 3.8114 3.8329 3.8957 3.8922 3.7962 4.1096 3.6628 3.9041 3.9181 3.9576 3.6437 3.6109 3.9039 3.9146 3.9176 3.9054 4.1970 4.2161 1.0040 1.0319 1.0025 1.0026 1.0048 0.9990 1.0191 1.0002 1.0021 1.0155 0.9936 1.0119 0.9951 0.9946 1.0027 1.0029 1.0025 1.0129 1.0058 1.0157 1.0049 1.0036 1.0122 1.0069 1.0103
dispcorr: -0.028264190 hartree
energy: -1094.902713444397
dipole: 7.02843 -7.60894 -0.58051 20.69518 -19.33215 1.36303 5.65134 -6.16185 -0.51051
magnitude: 1.56699 au
magnitude: 3.98298 debye
