program: Orca
programVersion: 5.0.2
elementType: O O O O N C C C C C C C C C C C C C C C C C C C H H H H H H H H H H H H H H H H H H H H H H H H H
charge: 0
multiplicity: 1
keywords: wb97x-d3
keywords: def2-TZVPP
keywords: def2/J RIJCOSX
keywords: DEFGRID2
keywords: scfconv7
keywords: smallprint printgap noloewdin
keywords: NOSOSCF
formula: C19H25NO4
InChI: InChI=1/C19H25NO4/c1-11(2)9-14-15(19(14,3)4)18(23)24-10-20-16(21)12-7-5-6-8-13(12)17(20)22/h9,14-15H,5-8,10H2,1-4H3
49 atoms
O  1.129386 -1.714199 -1.008656
O  1.861798 -1.565324 1.104071
O  -1.626385 -1.413081 -2.785641
O  -1.212197 -1.144003 1.735223
N  -1.155988 -1.583379 -0.535261
C  4.186703 0.1653 -0.000022
C  3.033092 1.10082 0.098758
C  2.871437 -0.248545 -0.625935
C  5.263962 0.514637 -1.001665
C  4.735457 -0.52282 1.225462
C  2.329278 1.386991 1.370516
C  1.944309 -1.23109 -0.050123
C  1.077133 1.847607 1.435763
C  -0.023159 -2.449029 -0.627363
C  0.424192 2.166053 2.744541
C  0.244571 2.079137 0.206203
C  -2.838558 -0.124845 -1.13506
C  -2.706701 -0.040166 0.189006
C  -3.822188 0.63246 -1.946645
C  -3.505075 0.846015 1.070353
C  -4.870803 1.25531 -1.023256
C  -4.237955 1.88283 0.217425
C  -1.836246 -1.090271 -1.644857
C  -1.620596 -0.957121 0.618536
H  3.043107 1.927881 -0.607097
H  2.825819 -0.181803 -1.706609
H  6.004557 1.179236 -0.552084
H  5.786337 -0.380873 -1.344247
H  4.857967 1.019369 -1.879537
H  3.993501 -0.731312 1.990134
H  5.205584 -1.469805 0.953886
H  5.50606 0.105166 1.677233
H  2.880311 1.239428 2.29401
H  0.111064 -2.972692 0.316946
H  -0.192663 -3.180884 -1.413281
H  -0.453184 1.533057 2.90283
H  1.098796 2.021526 3.588306
H  0.067493 3.199258 2.768094
H  -0.809069 2.209954 0.455886
H  0.557139 2.985162 -0.321074
H  0.319081 1.258628 -0.510479
H  -3.298759 1.405972 -2.518269
H  -4.290015 -0.022022 -2.686058
H  -4.215622 0.24304 1.645266
H  -2.858742 1.330869 1.806592
H  -5.443198 2.004437 -1.572307
H  -5.581427 0.483019 -0.714556
H  -5.001997 2.376995 0.81924
H  -3.531078 2.659111 -0.090832
elementType: O N C H
totalener: -1094.87437832 hartree
nucrepener: 2216.16911030 hartree
electener: -3311.04348862 hartree
oneelecener: -5894.82583513 hartree
twoeener: 2583.78234651 hartree
cpcmener: -0.03510697 hartree
kineticenergy: 1090.03714862 hartree
xcener: -105.971325391337 hartree
chargesum: 0.0000000
charge: -0.285608 -0.440121 -0.409146 -0.396324 -0.082606 0.134428 -0.025272 -0.099356 -0.264131 -0.296882 -0.262451 0.371480 -0.014102 0.071854 -0.216892 -0.271928 -0.050092 -0.090325 -0.068783 -0.086816 -0.135497 -0.134457 0.317705 0.281915 0.112624 0.093039 0.094790 0.096171 0.086387 0.094871 0.100403 0.098201 0.120029 0.130287 0.134268 0.080537 0.091214 0.102246 0.086062 0.124005 0.086367 0.100011 0.094215 0.110547 0.097347 0.080871 0.077755 0.083677 0.077485
qa: -0.2856 -0.4401 -0.4091 -0.3963 -0.0826 0.1344 -0.0253 -0.0994 -0.2641 -0.2969 -0.2625 0.3715 -0.0141 0.0719 -0.2169 -0.2719 -0.0501 -0.0903 -0.0688 -0.0868 -0.1355 -0.1345 0.3177 0.2819 0.1126 0.0930 0.0948 0.0962 0.0864 0.0949 0.1004 0.0982 0.1200 0.1303 0.1343 0.0805 0.0912 0.1022 0.0861 0.1240 0.0864 0.1000 0.0942 0.1105 0.0973 0.0809 0.0778 0.0837 0.0775
va: 2.1002 2.0527 2.1073 2.1073 3.0918 3.7659 3.8111 3.8244 3.8965 3.8906 3.8312 4.1369 3.6839 3.9116 3.9086 3.9618 3.6471 3.6136 3.9148 3.9157 3.9142 3.9045 4.2000 4.1861 1.0035 1.0325 1.0024 1.0025 1.0043 1.0175 1.0004 0.9985 1.0029 1.0196 1.0028 1.0056 1.0106 0.9935 1.0060 0.9989 1.0011 1.0069 1.0144 1.0068 1.0113 1.0096 1.0066 1.0102 1.0072
dispcorr: -0.028447204 hartree
energy: -1094.902825525766
dipole: 6.12207 -7.31645 -1.19438 19.50048 -17.91408 1.58640 5.23817 -5.99876 -0.76059
magnitude: 2.12643 au
magnitude: 5.40496 debye
