program: Orca
programVersion: 5.0.2
elementType: O O O O N C C C C C C C C C C C C C C C C C C C H H H H H H H H H H H H H H H H H H H H H H H H H
charge: 0
multiplicity: 1
keywords: wb97x-d3
keywords: def2-TZVPP
keywords: def2/J RIJCOSX
keywords: DEFGRID2
keywords: scfconv7
keywords: smallprint printgap noloewdin
keywords: NOSOSCF
formula: C19H25NO4
InChI: InChI=1/C19H25NO4/c1-11(2)9-14-15(19(14,3)4)18(23)24-10-20-16(21)12-7-5-6-8-13(12)17(20)22/h9,14-15H,5-8,10H2,1-4H3
49 atoms
O  1.182207 -2.022766 -1.149279
O  1.240874 -1.650984 1.051306
O  -1.745494 -2.524664 1.38562
O  -0.985152 -0.340189 -2.529818
N  -1.104793 -1.710832 -0.680977
C  3.817073 -0.014149 0.592373
C  2.867411 0.826617 -0.21308
C  2.912474 -0.699127 -0.395595
C  5.268603 0.03468 0.172458
C  3.652432 -0.157949 2.086752
C  1.683975 1.488551 0.364709
C  1.723505 -1.493836 -0.04216
C  1.216484 2.700664 0.042689
C  -0.087372 -2.648253 -1.039039
C  -0.004684 3.245784 0.721532
C  1.82297 3.627459 -0.966317
C  -2.63469 -0.45895 0.500377
C  -2.411583 0.186492 -0.644731
C  -3.583353 -0.023824 1.55413
C  -3.052026 1.462802 -1.045022
C  -4.510995 1.054012 0.989805
C  -3.747659 2.089444 0.165066
C  -1.800427 -1.68708 0.524076
C  -1.430734 -0.593139 -1.439849
H  3.322514 1.348617 -1.046664
H  3.375555 -1.012844 -1.32471
H  5.791154 -0.876585 0.470984
H  5.378847 0.139985 -0.907812
H  5.778238 0.878711 0.641422
H  2.633195 -0.038267 2.441044
H  4.009729 -1.132054 2.425205
H  4.259529 0.600919 2.584504
H  1.135989 0.943345 1.125714
H  -0.083332 -3.45901 -0.310585
H  -0.280475 -3.063438 -2.025415
H  -0.439768 2.534774 1.423954
H  0.226579 4.16169 1.272387
H  -0.771058 3.514965 -0.010517
H  1.088037 3.901074 -1.7277
H  2.130034 4.561551 -0.488055
H  2.693224 3.221897 -1.478262
H  -4.155612 -0.876645 1.926714
H  -3.02126 0.357815 2.412592
H  -2.308094 2.145134 -1.463928
H  -3.769052 1.269974 -1.849385
H  -5.272873 0.581176 0.363594
H  -5.040447 1.544513 1.807875
H  -2.999707 2.573548 0.79958
H  -4.426305 2.874918 -0.170549
elementType: O N C H
totalener: -1094.87517394 hartree
nucrepener: 2216.19436911 hartree
electener: -3311.06954305 hartree
oneelecener: -5895.01162924 hartree
twoeener: 2583.94208619 hartree
cpcmener: -0.03329032 hartree
kineticenergy: 1090.04221327 hartree
xcener: -105.973452326233 hartree
chargesum: 0.0000000
charge: -0.277391 -0.443552 -0.401973 -0.407664 -0.098792 0.121141 0.048027 -0.116482 -0.267158 -0.276435 -0.310178 0.385936 -0.047937 0.081092 -0.233860 -0.254612 -0.048176 -0.088551 -0.074617 -0.105359 -0.129427 -0.143843 0.311122 0.311964 0.114202 0.101037 0.094479 0.086471 0.094965 0.094042 0.099946 0.092225 0.120377 0.131460 0.143364 0.088503 0.108516 0.087947 0.096121 0.097570 0.088569 0.095242 0.100539 0.100725 0.111271 0.078082 0.080653 0.076700 0.083719
qa: -0.2774 -0.4436 -0.4020 -0.4077 -0.0988 0.1211 0.0480 -0.1165 -0.2672 -0.2764 -0.3102 0.3859 -0.0479 0.0811 -0.2339 -0.2546 -0.0482 -0.0886 -0.0746 -0.1054 -0.1294 -0.1438 0.3111 0.3120 0.1142 0.1010 0.0945 0.0865 0.0950 0.0940 0.0999 0.0922 0.1204 0.1315 0.1434 0.0885 0.1085 0.0879 0.0961 0.0976 0.0886 0.0952 0.1005 0.1007 0.1113 0.0781 0.0807 0.0767 0.0837
va: 2.1120 2.0620 2.1143 2.1061 3.0712 3.7101 3.7494 3.8289 3.9069 3.8965 3.8477 4.1630 3.7567 3.8977 3.9270 3.9414 3.6226 3.6523 3.9111 3.9180 3.9129 3.9098 4.2171 4.1897 1.0023 1.0265 1.0022 1.0047 1.0020 1.0115 1.0013 1.0015 1.0144 1.0160 0.9928 1.0053 0.9991 0.9923 0.9980 0.9963 1.0138 1.0156 1.0063 1.0078 1.0063 1.0073 1.0096 1.0109 1.0114
dispcorr: -0.026975191 hartree
energy: -1094.902149133344
dipole: 8.00699 -8.53596 -0.52897 24.53362 -22.92987 1.60375 6.39449 -6.83828 -0.44378
magnitude: 1.74607 au
magnitude: 4.43817 debye
