program: Orca
programVersion: 5.0.2
elementType: O O O O N C C C C C C C C C C C C C C C C C C C H H H H H H H H H H H H H H H H H H H H H H H H H
charge: 0
multiplicity: 1
keywords: wb97x-d3
keywords: def2-TZVPP
keywords: def2/J RIJCOSX
keywords: DEFGRID2
keywords: scfconv7
keywords: smallprint printgap noloewdin
keywords: NOSOSCF
formula: C19H25NO4
InChI: InChI=1/C19H25NO4/c1-11(2)9-14-15(19(14,3)4)18(23)24-10-20-16(21)12-7-5-6-8-13(12)17(20)22/h9,14-15H,5-8,10H2,1-4H3
49 atoms
O  1.148556 -1.347484 -0.412599
O  2.583884 -2.722473 -1.410155
O  -1.238667 -0.080618 -2.313609
O  -1.550901 -2.332114 1.619747
N  -1.131867 -1.471845 -0.479494
C  3.501411 0.085567 0.819011
C  3.2439 0.779796 -0.479205
C  3.42893 -0.732089 -0.462136
C  4.892139 0.208273 1.398234
C  2.438823 -0.012459 1.886554
C  1.954332 1.417188 -0.85739
C  2.368958 -1.695829 -0.806189
C  1.447832 2.514794 -0.290628
C  0.056803 -2.17627 -0.808096
C  0.156955 3.10987 -0.767093
C  2.099543 3.24081 0.845078
C  -2.755752 0.161245 -0.443198
C  -2.863256 -0.516176 0.700911
C  -3.606333 1.309198 -0.840131
C  -3.876925 -0.258207 1.752476
C  -4.376453 1.814134 0.381283
C  -4.964612 0.66398 1.19736
C  -1.644045 -0.42069 -1.231889
C  -1.804745 -1.556186 0.735786
H  4.114811 1.279405 -0.898773
H  4.38629 -1.080453 -0.831949
H  4.976341 1.114002 2.003147
H  5.125277 -0.642088 2.04261
H  5.657554 0.256406 0.622377
H  1.426909 0.132195 1.520146
H  2.482246 -0.979132 2.392375
H  2.620499 0.752417 2.644012
H  1.423882 0.987902 -1.701557
H  0.075637 -3.126329 -0.27477
H  0.084283 -2.368596 -1.880285
H  0.290368 4.15174 -1.070537
H  -0.261008 2.565751 -1.61359
H  -0.586374 3.117821 0.035287
H  1.449141 3.259297 1.72353
H  3.054056 2.809289 1.140654
H  2.277886 4.285345 0.574832
H  -2.993496 2.104272 -1.272174
H  -4.294218 0.996022 -1.632253
H  -4.305655 -1.199691 2.104367
H  -3.38957 0.193678 2.622548
H  -3.702869 2.400399 1.013337
H  -5.169995 2.489786 0.059029
H  -5.641001 0.081909 0.564687
H  -5.566068 1.055406 2.01905
elementType: O N C H
totalener: -1094.87438901 hartree
nucrepener: 2199.19066713 hartree
electener: -3294.06505614 hartree
oneelecener: -5860.05500568 hartree
twoeener: 2565.98994953 hartree
cpcmener: -0.03056003 hartree
kineticenergy: 1090.04174414 hartree
xcener: -105.971825083981 hartree
chargesum: 0.0000000
charge: -0.256409 -0.469263 -0.408858 -0.407859 -0.093764 0.083217 0.003826 -0.087758 -0.272956 -0.283650 -0.273904 0.390382 -0.002226 0.072340 -0.248160 -0.264162 -0.032606 -0.060603 -0.089507 -0.071495 -0.127918 -0.136102 0.269468 0.308227 0.114696 0.092025 0.090388 0.099369 0.087548 0.091438 0.114660 0.093782 0.112331 0.133354 0.131903 0.105583 0.083445 0.095411 0.099893 0.090831 0.107110 0.095660 0.107121 0.094322 0.100917 0.077175 0.081107 0.077734 0.081935
qa: -0.2564 -0.4693 -0.4089 -0.4079 -0.0938 0.0832 0.0038 -0.0878 -0.2730 -0.2837 -0.2739 0.3904 -0.0022 0.0723 -0.2482 -0.2642 -0.0326 -0.0606 -0.0895 -0.0715 -0.1279 -0.1361 0.2695 0.3082 0.1147 0.0920 0.0904 0.0994 0.0875 0.0914 0.1147 0.0938 0.1123 0.1334 0.1319 0.1056 0.0834 0.0954 0.0999 0.0908 0.1071 0.0957 0.1071 0.0943 0.1009 0.0772 0.0811 0.0777 0.0819
va: 2.1005 2.0378 2.0955 2.1067 3.1321 3.6932 3.7831 3.8656 3.9133 3.8862 3.8567 4.1380 3.6410 3.8994 3.9281 3.9397 3.6468 3.6961 3.9218 3.9162 3.9061 3.9144 4.1907 4.1956 1.0044 1.0263 1.0035 1.0006 1.0057 1.0082 1.0026 0.9992 1.0226 1.0041 1.0039 0.9993 1.0137 0.9930 0.9962 1.0056 1.0006 1.0118 1.0061 1.0142 1.0056 1.0092 1.0099 1.0068 1.0094
dispcorr: -0.027635775 hartree
energy: -1094.902024786431
dipole: 3.38364 -4.95900 -1.57536 23.30544 -21.13063 2.17481 11.28483 -10.07497 1.20986
magnitude: 2.94539 au
magnitude: 7.48658 debye
