program: Orca
programVersion: 5.0.2
elementType: O O O O N C C C C C C C C C C C C C C C C C C C H H H H H H H H H H H H H H H H H H H H H H H H H
charge: 0
multiplicity: 1
keywords: wb97x-d3
keywords: def2-TZVPP
keywords: def2/J RIJCOSX
keywords: DEFGRID2
keywords: scfconv7
keywords: smallprint printgap noloewdin
keywords: NOSOSCF
formula: C19H25NO4
InChI: InChI=1/C19H25NO4/c1-11(2)9-14-15(19(14,3)4)18(23)24-10-20-16(21)12-7-5-6-8-13(12)17(20)22/h9,14-15H,5-8,10H2,1-4H3
49 atoms
O  1.183017 -1.136329 -0.38987
O  2.633397 -2.42002 -1.486377
O  -0.971614 -1.709124 2.01864
O  -1.667802 -0.533672 -2.310391
N  -1.076683 -1.420793 -0.264642
C  3.76352 0.047375 0.872964
C  3.152012 1.024143 -0.072795
C  3.418237 -0.402879 -0.540005
C  5.241411 0.174233 1.157727
C  2.982183 -0.465891 2.05765
C  1.802698 1.608085 0.143028
C  2.395212 -1.416149 -0.852508
C  1.015373 2.101702 -0.814809
C  0.133655 -2.069156 -0.629137
C  -0.304569 2.734331 -0.493915
C  1.355905 2.037768 -2.270997
C  -2.670555 -0.324245 0.98675
C  -2.87989 0.011437 -0.287281
C  -3.481126 0.144694 2.136898
C  -3.950359 0.919157 -0.765265
C  -4.772748 0.785753 1.625572
C  -4.523629 1.694034 0.422381
C  -1.494116 -1.225734 1.047905
C  -1.844341 -0.642562 -1.12439
H  3.860082 1.716361 -0.522784
H  4.278262 -0.52074 -1.189779
H  5.673106 -0.788736 1.438258
H  5.79315 0.545789 0.293098
H  5.414707 0.867751 1.983462
H  3.321689 -1.466231 2.334014
H  3.152549 0.183631 2.918939
H  1.907598 -0.515251 1.900151
H  1.460168 1.670294 1.172243
H  0.273238 -2.964391 -0.02328
H  0.084713 -2.353323 -1.679538
H  -1.116012 2.258354 -1.050898
H  -0.544095 2.676491 0.568227
H  -0.316077 3.788496 -0.784831
H  1.290253 3.025583 -2.734696
H  2.352419 1.64399 -2.46461
H  0.639342 1.402029 -2.799499
H  -3.697269 -0.683559 2.816034
H  -2.894562 0.864165 2.717847
H  -3.563254 1.598944 -1.528134
H  -4.731077 0.328615 -1.25609
H  -5.477609 -0.001518 1.342577
H  -5.243462 1.350876 2.431313
H  -3.82406 2.486831 0.703934
H  -5.450984 2.185891 0.125502
elementType: O N C H
totalener: -1094.87420782 hartree
nucrepener: 2219.73463858 hartree
electener: -3314.60884640 hartree
oneelecener: -5901.25261104 hartree
twoeener: 2586.64376464 hartree
cpcmener: -0.03087571 hartree
kineticenergy: 1090.04382935 hartree
xcener: -105.971971261055 hartree
chargesum: 0.0000000
charge: -0.248544 -0.470503 -0.408547 -0.407661 -0.086284 0.137742 -0.018944 -0.155753 -0.268756 -0.282677 -0.241022 0.424202 -0.029799 0.064407 -0.236567 -0.263892 -0.037385 -0.077150 -0.068666 -0.083263 -0.134596 -0.131781 0.299978 0.277214 0.113701 0.094957 0.096082 0.086431 0.093132 0.103056 0.099682 0.077860 0.123031 0.142078 0.126554 0.075338 0.092064 0.112378 0.104160 0.093040 0.094327 0.094885 0.100558 0.097381 0.109334 0.077089 0.081166 0.077289 0.082676
qa: -0.2485 -0.4705 -0.4085 -0.4077 -0.0863 0.1377 -0.0189 -0.1558 -0.2688 -0.2827 -0.2410 0.4242 -0.0298 0.0644 -0.2366 -0.2639 -0.0374 -0.0771 -0.0687 -0.0833 -0.1346 -0.1318 0.3000 0.2772 0.1137 0.0950 0.0961 0.0864 0.0931 0.1031 0.0997 0.0779 0.1230 0.1421 0.1266 0.0753 0.0921 0.1124 0.1042 0.0930 0.0943 0.0949 0.1006 0.0974 0.1093 0.0771 0.0812 0.0773 0.0827
va: 2.1014 2.0350 2.1019 2.0956 3.1169 3.7366 3.7869 3.8892 3.9080 3.9148 3.8268 4.1046 3.6935 3.9054 3.9333 3.9484 3.6509 3.6387 3.9136 3.9077 3.9131 3.9094 4.1934 4.1787 1.0045 1.0281 1.0018 1.0053 1.0018 1.0015 0.9998 1.0108 0.9977 0.9965 1.0114 0.9968 1.0062 0.9985 0.9999 1.0047 1.0047 1.0141 1.0064 1.0105 1.0047 1.0069 1.0096 1.0086 1.0103
dispcorr: -0.028518343 hartree
energy: -1094.902726160029
dipole: 2.59928 -4.23943 -1.64015 18.88781 -17.05491 1.83290 6.29151 -5.23853 1.05299
magnitude: 2.67552 au
magnitude: 6.80062 debye
